1,4-Benzenedicarboxylic acid, dimethyl ester
- Formula: C10H10O4
- Molecular weight: 194.1840
- IUPAC Standard InChIKey: WOZVHXUHUFLZGK-UHFFFAOYSA-N
- CAS Registry Number: 120-61-6
- Chemical structure:
View 3d structure (requires JavaScript / HTML 5) - Other names: Terephthalic acid, dimethyl ester; Dimethyl p-phthalate; Dimethyl terephthalate; Dimethyl 1,4-benzenedicarboxylate; Methyl 4-(carbomethoxy)benzoate; Dimethyl p-benzenedicarboxylate; Dimethylester kyseliny isoftalove; DMT; NCI-C50055; Dimethylester kyseliny tereftalove; Dimethyl ester of 1,4-benzenedicarboxylic acid; Terephthalate, dimethyl; 1,4-Benzenedicarboxylic acid, 1,4-dimethyl ester; Methyl p-(methoxycarbonyl)benzoate; NSC 3503; Dimethyl terphthalate

Condensed phase thermochemistry data

Data compiled as indicated in comments:
ALS - Hussein Y. Afeefy, Joel F. Liebman, and Stephen E. Stein
DH - Eugene S. Domalski and Elizabeth D. Hearing
Quantity | Value | Units | Method | Reference | Comment |
---|---|---|---|---|---|
ΔfH°solid | -710.0 | kJ/mol | Ccb | Karyakin, Rabinovich, et al., 1978 | ALS |
ΔfH°solid | -732.6 ± 1.0 | kJ/mol | Ccb | Colomina, Laynez, et al., 1972 | ALS |
Quantity | Value | Units | Method | Reference | Comment |
ΔcH°solid | -4631.66 ± 0.88 | kJ/mol | Ccb | Colomina, Laynez, et al., 1972 | Corresponding ΔfHºsolid = -732.59 kJ/mol (simple calculation by NIST; no Washburn corrections); ALS |
Constant pressure heat capacity of solid
Cp,solid (J/mol*K) | Temperature (K) | Reference | Comment |
---|---|---|---|
261.1 | 298.15 | Elliott and Chris, 1968 | T = 30 to 200°C.; DH |
276.1 | 353. | Smith and Dole, 1956 | T = 80 to 190°C. Equation only.; DH |

Gas phase ion energetics data

Data evaluated as indicated in comments:
HL - Edward P. Hunter and Sharon G. Lias
Data compiled as indicated in comments:
RDSH - Henry M. Rosenstock, Keith Draxl, Bruce W. Steiner, and John T. Herron
B - John E. Bartmess
Quantity | Value | Units | Method | Reference | Comment |
---|---|---|---|---|---|
Proton affinity (review) | 843.2 | kJ/mol | N/A | Hunter and Lias, 1998 | HL |
Quantity | Value | Units | Method | Reference | Comment |
Gas basicity | 812.3 | kJ/mol | N/A | Hunter and Lias, 1998 | HL |
Electron affinity determinations
EA (eV) | Method | Reference | Comment |
---|---|---|---|
0.824 ± 0.087 | IMRE | Mishima, Huh, et al., 1995 | ΔGea(343 K)=-20.2 kcal/mol. Reanchored to EA(PhNO2), Kebarle and Chowdhury, 1987.; B |
0.824 ± 0.087 | IMRE | Huh, Kang, et al., 1999 | ΔG(EA) 343K; anchored to ΔG value. Including anchor ΔS, EA is ca. 0.4 kcal/mol more bound.; B |
0.640011 | ECD | Kuhn, Levins, et al., 1968 | Done at constant temperature, accuracy uncertain: Chen and Wentworth, 1989;; B |
Ionization energy determinations
IE (eV) | Method | Reference | Comment |
---|---|---|---|
9.78 ± 0.03 | EI | Kuhn, Levins, et al., 1968 | RDSH |

Phase change data

Data compiled as indicated in comments:
TRC - Thermodynamics Research Center, NIST Boulder Laboratories, Chris Muzny director
AC - William E. Acree, Jr., James S. Chickos
ALS - Hussein Y. Afeefy, Joel F. Liebman, and Stephen E. Stein
DH - Eugene S. Domalski and Elizabeth D. Hearing

Quantity Value Units Method Reference Comment
Tfus415.2KN/ADozen, Fujishima, et al., 1978Uncertainty assigned by TRC = 0.2 K; TRC
Tfus413.80KN/AElliott and Chris, 1968, 2Uncertainty assigned by TRC = 0.01 K; TRC
Tfus413.8KN/ASmith and Dole, 1956, 2Uncertainty assigned by TRC = 0.2 K; TRC
Tfus413.KN/AShirley and Reedy, 1951Uncertainty assigned by TRC = 4. K; TRC
Tfus413.KN/AHennion and Kurtz, 1943Uncertainty assigned by TRC = 1.5 K; TRC
Quantity Value Units Method Reference Comment
Δsub104.6 ± 0.3kJ/molCRoux, Jimenez, et al., 1998ALS
Δsub104.6 ± 0.3kJ/molN/AVictoria Roux, Jime´nez, et al., 1998AC

Enthalpy of vaporization

ΔvapH (kJ/mol) Temperature (K) Method Reference Comment
62.428.AStephenson and Malanowski, 1987Based on data from 413. - 523. K.; AC

Enthalpy of sublimation

ΔsubH (kJ/mol) Temperature (K) Method Reference Comment
103.8 ± 0.3321.MEVictoria Roux, Jime´nez, et al., 1998Based on data from 311. - 330. K.; AC
94.4388.N/AStephenson and Malanowski, 1987Based on data from 373. - 413. K.; AC
88.3393.GSKraus, Beranek, et al., 1962Based on data from 373. - 413. K.; AC

Enthalpy of fusion

ΔfusH (kJ/mol) Temperature (K) Reference Comment
32.000415.4Karyakin and Shvetsova, 1982DH
31.631413.79Elliott and Chris, 1968DH
32.100413.8Smith and Dole, 1956DH
32.09413.8Acree, 1993AC

Entropy of fusion

ΔfusS (J/mol*K) Temperature (K) Reference Comment
77.0415.4Karyakin and Shvetsova, 1982DH
76.44413.79Elliott and Chris, 1968DH
77.6413.8Smith and Dole, 1956DH

In addition to the Thermodynamics Research Center (TRC) data available from this site, much more physical and chemical property data is available from the following TRC products:

Kovats' RI, non-polar column, isothermal

View large format table.

Column type Active phase Temperature (C) I Reference Comment
CapillaryUltra-1125.1461.Herrmann, Dufka, et al., 198625. m/0.20 mm/0.32 μm, N2
CapillaryUltra-1150.1470.Herrmann, Dufka, et al., 198625. m/0.20 mm/0.32 μm, N2
CapillaryUltra-1175.1480.Herrmann, Dufka, et al., 198625. m/0.20 mm/0.32 μm, N2
CapillaryUltra-1200.1492.Herrmann, Dufka, et al., 198625. m/0.20 mm/0.32 μm, N2
PackedOV-1150.1468.Fedoreev and Maksimov, 1977Gaschrom; Column length: 1.5 m

Kovats' RI, non-polar column, custom temperature program

View large format table.

Column type Active phase I Reference Comment
PackedSE-301475.Ramsey, Lee, et al., 1980He, Chromosorb G HP (80-100 mesh); Column length: 1.5 m; Program: not specified

Van Den Dool and Kratz RI, non-polar column, custom temperature program

View large format table.

Column type Active phase I Reference Comment
PackedSE-301469.Peng, Ding, et al., 1988Supelcoport; Chromosorb; Column length: 3.05 m; Program: 40C(5min) => 10C/min => 200C or 250C (60min)

Normal alkane RI, non-polar column, temperature ramp

View large format table.

Column type Active phase I Reference Comment
CapillaryUltra-ALLOY-51512.Tsuge, Ohtan, et al., 201130. m/0.25 mm/0.25 μm, 40. C @ 2. min, 20. K/min, 320. C @ 13. min
CapillaryUltra-11468.Okumura, 199125. m/0.32 mm/0.25 μm, He, 3. K/min; Tstart: 80. C; Tend: 260. C

Normal alkane RI, non-polar column, custom temperature program

View large format table.

Column type Active phase I Reference Comment
CapillaryPolydimethyl siloxanes1473.Zenkevich, 2003Program: not specified
CapillaryOV-1, SE-30, Methyl silicone, SP-2100, OV-101, DB-1, etc.1475.Waggott and Davies, 1984Hydrogen; Column length: 50. m; Column diameter: 0.32 mm; Program: not specified
OtherMethyl Silicone1475.Ardrey and Moffat, 1981Program: not specified

References

Karyakin, Rabinovich, et al., 1978
Karyakin, N.V.; Rabinovich, I.B.; Sokolov, L.B.,
Thermodynamics of the synthesis of isomeric poly(phenylenephthalamides),
Vysokomol. Soedin. Ser. B, 1978, 20, 662-666. [all data]
Colomina, Laynez, et al., 1972
Colomina, M.; Laynez, J.L.; Perez-Ossorio, R.; Turrion, C.,
Enthalpies of combustion and formation of six methyl esters of benzene carboxylic acids,
J. Chem. Thermodyn., 1972, 4, 499-506. [all data]
Elliott and Chris, 1968
Elliott, J.H.; Chris, M.D.,
Some thermodynamic properties of high purity dimethyl terephthalate,
J. Chem. Eng. Data, 1968, 13, 475-479. [all data]
Smith and Dole, 1956
Smith, C.W.; Dole, M.,
Specific heat of synthetic high polymers. VII. Polyethylene terephthalate,
J. Polym. Sci., 1956, 20, 37-56. [all data]
Hunter and Lias, 1998
Hunter, E.P.; Lias, S.G.,
Evaluated Gas Phase Basicities and Proton Affinities of Molecules: An Update,
J. Phys. Chem. Ref. Data, 1998, 27, 3, 413-656, https://doi.org/10.1063/1.556018
. [all data]
Mishima, Huh, et al., 1995
Mishima, M.; Huh, C.; Lee, H.W.; Nakamura, H.; Fujio, M.; Tsuno, Y.,
Electron affinities of acetophenones and methyl benzoates. Varying resonance demand of aromatic radical anions,
Tetrahed. Lett., 1995, 36, 13, 2265, https://doi.org/10.1016/0040-4039(95)00267-G
. [all data]
Kebarle and Chowdhury, 1987
Kebarle, P.; Chowdhury, S.,
Electron affinities and electron transfer reactions,
Chem. Rev., 1987, 87, 513. [all data]
Huh, Kang, et al., 1999
Huh, C.; Kang, C.H.; Lee, H.W.; Nakamura, H.; Mishima, M.; Tsuno, Y.; Yamataka, H.,
Thermodynamic stabilities and resonance demand of aromatic radical anions in the gas phase,
Bull. Chem. Soc. Japan, 1999, 72, 5, 1083-1091, https://doi.org/10.1246/bcsj.72.1083
. [all data]
Kuhn, Levins, et al., 1968
Kuhn, W.F.; Levins, R.J.; Lilly, A.C., Jr.,
Electron affinities and ionization potentials of phthalate compounds,
J. Chem. Phys., 1968, 49, 5550. [all data]
Chen and Wentworth, 1989
Chen, E.C.M.; Wentworth, W.E.,
Experimental Determination of Electron Affinities of Organic Molecules,
Mol. Cryst. Liq. Cryst., 1989, 171, 271. [all data]