molybdenum oxide
- Formula: MoO
- Molecular weight: 111.96
- IUPAC Standard InChIKey: SQLNERXDBOZINP-UHFFFAOYSA-N
- CAS Registry Number: 12058-07-0
- Chemical structure:
View 3d structure (requires JavaScript / HTML 5) - Other names: Molybdenum monoxide

Gas phase thermochemistry data

Quantity | Value | Units | Method | Reference | Comment |
---|---|---|---|---|---|
ΔfH°gas | 310.96 | kJ/mol | Review | Chase, 1998 | Data last reviewed in September, 1978 |
Quantity | Value | Units | Method | Reference | Comment |
S°gas,1 bar | 241.75 | J/mol*K | Review | Chase, 1998 | Data last reviewed in September, 1978 |
Gas Phase Heat Capacity (Shomate Equation)
Cp° = A + B*t + C*t2 + D*t3 +
E/t2
H° − H°298.15= A*t + B*t2/2 +
C*t3/3 + D*t4/4 − E/t + F − H
S° = A*ln(t) + B*t + C*t2/2 + D*t3/3 −
E/(2*t2) + G
Cp = heat capacity (J/mol*K)
H° = standard enthalpy (kJ/mol)
S° = standard entropy (J/mol*K)
t = temperature (K) / 1000.
View plot Requires a JavaScript / HTML 5 canvas capable browser.
Temperature (K) | 298. to 6000. |
---|---|
A | 36.49544 |
B | 0.908920 |
C | -0.173237 |
D | 0.014089 |
E | -0.069038 |
F | 299.8074 |
G | 285.2680 |
H | 310.9595 |
Reference | Chase, 1998 |
Comment | Data last reviewed in September, 1978 |

Gas phase ion energetics data

Data compiled as indicated in comments:
RDSH - Henry M. Rosenstock, Keith Draxl, Bruce W. Steiner, and John T. Herron
B - John E. Bartmess
Electron affinity determinations
EA (eV) | Method | Reference | Comment |
---|---|---|---|
1.2900 ± 0.0060 | LPES | Gunion, Dixon-Warren, et al., 1996 | B |
Ionization energy determinations
IE (eV) | Method | Reference | Comment |
---|---|---|---|
8.0 ± 0.6 | EI | DeMaria, Burns, et al., 1960 | RDSH |

References

Chase, 1998
Chase, M.W., Jr.,
NIST-JANAF Themochemical Tables, Fourth Edition,
J. Phys. Chem. Ref. Data, Monograph 9, 1998, 1-1951. [all data]
Gunion, Dixon-Warren, et al., 1996
Gunion, R.F.; Dixon-Warren, J.; Lineberger, W.C.; Morse, M.D.,
Ultraviolet Photoelectron Spectroscopy of Molybdenum and Molybdenum Monoxide Anions,
J. Chem. Phys., 1996, 104, 5, 1765, https://doi.org/10.1063/1.470975
. [all data]
DeMaria, Burns, et al., 1960
DeMaria, G.; Burns, R.P.; Drowart, J.; Inghram, M.G.,
Mass spectrometric study of gaseous molybdenum, tungsten, and uranium oxides,
J. Chem. Phys., 1960, 32, 1373. [all data]