Benzoic acid, 2-methylpropyl ester
- Formula: C11H14O2
- Molecular weight: 178.2277
- IUPAC Standard InChIKey: KYZHGEFMXZOSJN-UHFFFAOYSA-N
- CAS Registry Number: 120-50-3
- Chemical structure:
View 3d structure (requires JavaScript / HTML 5) - Other names: Benzoic acid, isobutyl ester; Isobutyl benzoate; 2-methylpropyl benzoate

Phase change data

Data compiled as indicated in comments:
BS - Robert L. Brown and Stephen E. Stein
TRC - Thermodynamics Research Center, NIST Boulder Laboratories, Chris Muzny director
AC - William E. Acree, Jr., James S. Chickos
Quantity | Value | Units | Method | Reference | Comment |
---|---|---|---|---|---|
Tboil | 514. ± 3. | K | AVG | N/A | Average of 7 values; Individual data points |
Enthalpy of vaporization
ΔvapH (kJ/mol) | Temperature (K) | Method | Reference | Comment |
---|---|---|---|---|
63.2 | 394. | BG | Katayama, 1988 | Based on data from 374. to 474. K.; AC |
55.7 | 452. | BG | Katayama, 1988 | Based on data from 374. to 474. K.; AC |
59.1 | 358. | A | Stephenson and Malanowski, 1987 | Based on data from 343. to 405. K.; AC |
Antoine Equation Parameters
log10(P) = A − (B / (T + C))
P = vapor pressure (bar)
T = temperature (K)
View plot Requires a JavaScript / HTML 5 canvas capable browser.
Temperature (K) | A | B | C | Reference | Comment |
---|---|---|---|---|---|
337. to 510. | 5.24134 | 2550.831 | -22.973 | Stull, 1947 | Coefficents calculated by NIST from author's data. |

Gas phase ion energetics data

Data compiled by: Sharon G. Lias, Rhoda D. Levin, and Sherif A. Kafafi
Appearance energy determinations
Ion | AE (eV) | Other Products | Method | Reference | Comment |
---|---|---|---|---|---|
C6H5+ | 15.0 ± 0.04 | ? | EI | Tajima, Azami, et al., 1977 | |
C7H5O+ | 11.3 ± 0.10 | OC4H9 | EI | Tajima, Azami, et al., 1977 |

Normal alkane RI, non-polar column, temperature ramp

Data compiled by: NIST Mass Spectrometry Data Center, William E. Wallace, director

Column type CapillaryCapillaryCapillaryCapillaryCapillary
Active phase HP-1HP-1HP-1Methyl SiliconeHP-1
Column length (m) 50.50.50.60.50.
Carrier gas HeHeHeHeHe
Substrate
Column diameter (mm) 0.20.20.20.30.2
Phase thickness (μm) 0.330.50.33 0.5
Tstart (C) 60.60.60.50.60.
Tend (C) 250.250.250.240.220.
Heat rate (K/min) 2.2.2.3.2.
Initial hold (min) 4. 4.
Final hold (min) 30.120.30. 45.
I 1308.1298.1308.1326.1306.
ReferenceCastel, Fernandez, et al., 2006Castel, Fernandez, et al., 2006, 2Castel, Fernandez, et al., 2006, 2Chalchat and Özcan, 2005Fernandez, Lizzani-Cuvelier, et al., 2003
Comment MSDC-RI MSDC-RI MSDC-RI MSDC-RI MSDC-RI
Column type CapillaryCapillary
Active phase SE-30DB-1
Column length (m) 25.60.
Carrier gas N2
Substrate
Column diameter (mm) 0.220.32
Phase thickness (μm)
Tstart (C) 100.50.
Tend (C)  250.
Heat rate (K/min) 6.4.
Initial hold (min)  0.1
Final hold (min)  5.
I 1306.1302.
ReferenceKorhonen, 1986Flath, Mon, et al., 1983
Comment MSDC-RI MSDC-RI

Van Den Dool and Kratz RI, polar column, temperature ramp

Data compiled by: NIST Mass Spectrometry Data Center, William E. Wallace, director

Column type CapillaryCapillaryCapillaryCapillaryCapillary
Active phase OV-351OV-351OV-351OV-351OV-351
Column length (m) 25.25.25.25.25.
Carrier gas N2N2N2N2N2
Substrate
Column diameter (mm) 0.220.320.320.320.32
Phase thickness (μm)
Tstart (C) 100.100.100.100.100.
Tend (C) 220.230.230.230.
Heat rate (K/min) 6.10.2.6.6.
Initial hold (min)
Final hold (min)
I 1776.1817.1785.1800.1789.
ReferenceKorhonen, 1986Korhonen and Lind, 1985Korhonen and Lind, 1985Korhonen and Lind, 1985Korhonen, 1985
Comment MSDC-RI MSDC-RI MSDC-RI MSDC-RI MSDC-RI
Column type Packed
Active phase Carbowax 20M
Column length (m)
Carrier gas
Substrate Celite 545
Column diameter (mm)
Phase thickness (μm)
Tstart (C) 75.
Tend (C) 228.
Heat rate (K/min) 4.6
Initial hold (min)
Final hold (min)
I 1799.
Referencevan den Dool and Kratz, 1963
Comment MSDC-RI

Van Den Dool and Kratz RI, non-polar column, temperature ramp

Data compiled by: NIST Mass Spectrometry Data Center, William E. Wallace, director

Column type CapillaryCapillaryCapillaryCapillaryPacked
Active phase SE-30SE-30SE-30SE-30SE-30
Column length (m) 25.25.25.25.
Carrier gas N2N2N2N2
Substrate     Celite
Column diameter (mm) 0.320.320.320.33
Phase thickness (μm)
Tstart (C) 100.100.100.100.75.
Tend (C) 300.300.300. 228.
Heat rate (K/min) 10.2.6.6.
Initial hold (min)
Final hold (min)
I 1315.1305.1310.1312.1318.
ReferenceKorhonen and Lind, 1985Korhonen and Lind, 1985Korhonen and Lind, 1985Korhonen, 1985van den Dool and Kratz, 1963
Comment MSDC-RI MSDC-RI MSDC-RI MSDC-RI MSDC-RI

References

Katayama, 1988
Katayama, Hirotake,
Vapor pressures of methyl, ethyl, n-propyl, isobutyl, and n-butyl benzoates at reduced pressures,
J. Chem. Eng. Data, 1988, 33, 2, 75-77, https://doi.org/10.1021/je00052a002
. [all data]
Stephenson and Malanowski, 1987
Stephenson, Richard M.; Malanowski, Stanislaw,
Handbook of the Thermodynamics of Organic Compounds, 1987, https://doi.org/10.1007/978-94-009-3173-2
. [all data]
Stull, 1947
Stull, Daniel R.,
Vapor Pressure of Pure Substances. Organic and Inorganic Compounds,
Ind. Eng. Chem., 1947, 39, 4, 517-540, https://doi.org/10.1021/ie50448a022
. [all data]
Tajima, Azami, et al., 1977
Tajima, S.; Azami, T.; Tsuchiya, T.,
An investigation of the decomposition of the common intermediate ions produced by electron impact,
Org. Mass Spectrom., 1977, 12, 24. [all data]