Trisodium triiodide
- Formula: I3Na3
- Molecular weight: 449.68272
- IUPAC Standard InChIKey: YFPFNQMIZPDQRR-UHFFFAOYSA-K
- CAS Registry Number: 120471-84-3
- Chemical structure:
View 3d structure (requires JavaScript / HTML 5) - Permanent link for this species. Use this link for bookmarking this species for future reference.

Gas phase ion energetics data

Data compiled by: Henry M. Rosenstock, Keith Draxl, Bruce W. Steiner, and John T. Herron
Appearance energy determinations
Ion | AE (eV) | Other Products | Method | Reference | Comment |
---|---|---|---|---|---|
Na3I2+ | 8.6 ± 0.3 | I | EI | Platel, 1965 |

References

Platel, 1965
Platel, G.,
Mesures des potentials d'apparition des ions obtenus par impact electronique dans la phase vapeur des iodures alcalins et des melanges LiI-MI,
J. Chim. Phys., 1965, 62, 1176. [all data]