Gold, compound with holmium (1:1)
- Formula: AuHo
- Molecular weight: 361.89689
- CAS Registry Number: 12044-80-3

Gas phase ion energetics data

Data compiled as indicated in comments:
LLK - Sharon G. Lias, Rhoda D. Levin, and Sherif A. Kafafi
Ionization energy determinations
IE (eV) | Method | Reference | Comment |
---|---|---|---|
6.2 ± 0.5 | EI | Cocke and Gingerich, 1971 | LLK |

References

Cocke and Gingerich, 1971
Cocke, D.L.; Gingerich, K.A.,
Mass spectrometric determination of the dissociation energies of the molecules Ho2, HoAg, and HoAu,
J. Phys. Chem., 1971, 75, 3264. [all data]