tin telluride
- Formula: SnTe
- Molecular weight: 246.31
- IUPAC Standard InChIKey: WYUZTTNXJUJWQQ-UHFFFAOYSA-N
- CAS Registry Number: 12040-02-7
- Chemical structure:
View 3d structure (requires JavaScript / HTML 5) - Other names: Tin monotelluride

Gas phase ion energetics data

Data compiled as indicated in comments:
LL - Sharon G. Lias and Joel F. Liebman
LLK - Sharon G. Lias, Rhoda D. Levin, and Sherif A. Kafafi
RDSH - Henry M. Rosenstock, Keith Draxl, Bruce W. Steiner, and John T. Herron
Ionization energy determinations
IE (eV) | Method | Reference | Comment |
---|---|---|---|
9.1 ± 0.5 | EI | Colin and Drowart, 1964 | RDSH |
8.545 ± 0.007 | PE | Wang, Niu, et al., 1990 | Vertical value; LL |
8.61 | PE | White, Rosenberg, et al., 1979 | Vertical value; LLK |
9.39 | PE | Wu and Fehlner, 1976 | Vertical value; LLK |
8.65 | PE | Wu and Fehlner, 1976 | Vertical value; LLK |
8.95 | PE | Wu and Fehlner, 1976 | Vertical value; LLK |
Appearance energy determinations
Ion | AE (eV) | Other Products | Method | Reference | Comment |
---|---|---|---|---|---|
Te+ | 12.1 ± 1.0 | Sn | EI | Colin and Drowart, 1964 | RDSH |

References

Colin and Drowart, 1964
Colin, R.; Drowart, J.,
Thermodynamic study of tin selenide and tin telluride using a mass spectrometer,
J. Chem. Soc. Faraday Trans., 1964, 60, 673. [all data]
Wang, Niu, et al., 1990
Wang, L.; Niu, W.B.; Lee, T.; Shirley, D.A.,
Photoelectron spectroscopy and electronic structure of heavy group IV-VI diatomics,
J. Chem. Phys., 1990, 92, 899. [all data]
White, Rosenberg, et al., 1979
White, M.G.; Rosenberg, R.A.; Lee, S.T.; Shirley, D.A.,
The He(I) photoelectron spectroscopy of heavy group IV-VI diatomics,
J. Electron Spectrosc. Relat. Phenom., 1979, 17, 323. [all data]
Wu and Fehlner, 1976
Wu, M.; Fehlner, T.P.,
Valence level photoelectron spectra of some heavy group 4-6 diatomic molecules,
J. Am. Chem. Soc., 1976, 98, 7578. [all data]