ruthenium (IV) oxide
- Formula: O2Ru
- Molecular weight: 133.07
- IUPAC Standard InChIKey: YLLQCERGRSPHMS-UHFFFAOYSA-N
- CAS Registry Number: 12036-10-1
- Chemical structure:
View 3d structure (requires JavaScript / HTML 5) - Other names: Ruthenium dioxide

Gas phase ion energetics data

Data compiled by: Henry M. Rosenstock, Keith Draxl, Bruce W. Steiner, and John T. Herron
Ionization energy determinations
IE (eV) | Method | Reference |
---|---|---|
10.6 | EI | Norman, Staley, et al., 1968 |
Appearance energy determinations
Ion | AE (eV) | Other Products | Method | Reference | Comment |
---|---|---|---|---|---|
RuO+ | 12.8 | O | EI | Norman, Staley, et al., 1968 | |
Ru+ | 13.0 | ? | EI | Norman, Staley, et al., 1968 |

References

Norman, Staley, et al., 1968
Norman, J.H.; Staley, H.G.; Bell, W.E.,
Mass spectrometric study of the noble metal oxides. Ruthenium-oxygen system,
Advan. Chem. Ser., 1968, 72, 101. [all data]