zirconium oxide
- Formula: OZr
- Molecular weight: 107.223
- IUPAC Standard InChIKey: GEIAQOFPUVMAGM-UHFFFAOYSA-N
- CAS Registry Number: 12036-01-0
- Chemical structure:
View 3d structure (requires JavaScript / HTML 5) - Other names: Zirconium monoxide

Gas phase thermochemistry data

Quantity | Value | Units | Method | Reference | Comment |
---|---|---|---|---|---|
ΔfH°gas | 58.58 | kJ/mol | Review | Chase, 1998 | Data last reviewed in December, 1965 |
Quantity | Value | Units | Method | Reference | Comment |
S°gas,1 bar | 227.62 | J/mol*K | Review | Chase, 1998 | Data last reviewed in December, 1965 |
Gas Phase Heat Capacity (Shomate Equation)
Cp° = A + B*t + C*t2 + D*t3 +
E/t2
H° − H°298.15= A*t + B*t2/2 +
C*t3/3 + D*t4/4 − E/t + F − H
S° = A*ln(t) + B*t + C*t2/2 + D*t3/3 −
E/(2*t2) + G
Cp = heat capacity (J/mol*K)
H° = standard enthalpy (kJ/mol)
S° = standard entropy (J/mol*K)
t = temperature (K) / 1000.
View plot Requires a JavaScript / HTML 5 canvas capable browser.
Temperature (K) | 298. to 1000. | 1000. to 2000. | 2000. to 4000. | 4000. to 6000. |
---|---|---|---|---|
A | 28.02410 | -131.1710 | 163.6570 | 2.270551 |
B | 17.75270 | 234.5760 | -72.70350 | 12.80420 |
C | -17.90500 | -104.0950 | 16.00160 | -1.179551 |
D | 13.88750 | 15.50370 | -1.207071 | 0.032295 |
E | -0.112231 | 26.96780 | -80.68620 | 158.4170 |
F | 49.18470 | 155.3680 | -126.9750 | 181.4960 |
G | 256.2860 | 95.55190 | 296.6620 | 296.8410 |
H | 58.57600 | 58.57600 | 58.57600 | 58.57600 |
Reference | Chase, 1998 | Chase, 1998 | Chase, 1998 | Chase, 1998 |
Comment | Data last reviewed in December, 1965 | Data last reviewed in December, 1965 | Data last reviewed in December, 1965 | Data last reviewed in December, 1965 |

Gas phase ion energetics data

Data compiled as indicated in comments:
LLK - Sharon G. Lias, Rhoda D. Levin, and Sherif A. Kafafi
RDSH - Henry M. Rosenstock, Keith Draxl, Bruce W. Steiner, and John T. Herron
Ionization energy determinations
IE (eV) | Method | Reference | Comment |
---|---|---|---|
5.8 ± 0.2 | EI | Murad and Hildenbrand, 1975 | LLK |
6.2 ± 0.1 | EI | Rauh and Ackermann, 1974 | LLK |
6.6 ± 0.3 | EI | Gingerich, 1968 | RDSH |
5.5 | EI | Chupka, Berkowitz, et al., 1957 | RDSH |

Constants of diatomic molecules

Data compiled by: Klaus P. Huber and Gerhard H. Herzberg
Data collected through August, 1975
Symbol | Meaning |
---|---|
State | electronic state and / or symmetry symbol |
Te | minimum electronic energy (cm-1) |
ωe | vibrational constant – first term (cm-1) |
ωexe | vibrational constant – second term (cm-1) |
ωeye | vibrational constant – third term (cm-1) |
Be | rotational constant in equilibrium position (cm-1) |
αe | rotational constant – first term (cm-1) |
γe | rotation-vibration interaction constant (cm-1) |
De | centrifugal distortion constant (cm-1) |
βe | rotational constant – first term, centrifugal force (cm-1) |
re | internuclear distance (Å) |
Trans. | observed transition(s) corresponding to electronic state |
ν00 | position of 0-0 band (units noted in table) |
State | Te | ωe | ωexe | ωeye | Be | αe | γe | De | βe | re | Trans. | ν00 |
---|---|---|---|---|---|---|---|---|---|---|---|---|
Additional unidentified systems in gas phase emission: | ||||||||||||
a) Headless bands in the region 12600 - 13200 cm-1; no analysis. | ||||||||||||
↳Kiess, 1948; Afaf, 1950 | ||||||||||||
b) Isolated R shaded band (one R, one P branch) at 12203.1 cm-1, accompanied by a weaker head at 12216.7 cm-1. | ||||||||||||
↳missing citation; Akerlind, 1956; missing citation | ||||||||||||
c) 1 | 10750.3 H | |||||||||||
↳Meggers and Kiess, 1932; Afaf, 1950 | ||||||||||||
State | Te | ωe | ωexe | ωeye | Be | αe | γe | De | βe | re | Trans. | ν00 |
c) | 10731.4 H | |||||||||||
↳Meggers and Kiess, 1932; Afaf, 1950 | ||||||||||||
10715.3 H | ||||||||||||
↳Meggers and Kiess, 1932; Afaf, 1950 | ||||||||||||
10700.1 H | ||||||||||||
↳Meggers and Kiess, 1932; Afaf, 1950 | ||||||||||||
10685.3 H | ||||||||||||
↳Meggers and Kiess, 1932; Afaf, 1950 | ||||||||||||
and in matrix absorption at 17025 2 and 19397 3 cm-1. | ||||||||||||
↳Weltner and McLeod, 1965 | ||||||||||||
State | Te | ωe | ωexe | ωeye | Be | αe | γe | De | βe | re | Trans. | ν00 |
f (3Δ) | f → a R | 33993.7 H | ||||||||||
↳Afaf, 1949; Afaf, 1950 | ||||||||||||
f → a R | 33888.4 H | |||||||||||
↳Afaf, 1949; Afaf, 1950 | ||||||||||||
f → a R | 33685.2 H | |||||||||||
↳Afaf, 1949; Afaf, 1950 | ||||||||||||
e | e → (a) R | 28780.3 4 HQ | ||||||||||
↳Afaf, 1949; Afaf, 1950 | ||||||||||||
e → (a) R | 28620.1 4 HQ | |||||||||||
↳Afaf, 1949; Afaf, 1950 | ||||||||||||
e → (a) R | 28501.7 4 HQ | |||||||||||
↳Afaf, 1949; Afaf, 1950 | ||||||||||||
State | Te | ωe | ωexe | ωeye | Be | αe | γe | De | βe | re | Trans. | ν00 |
E 1Σ+ | 27212.4 | 843.27 Z | 3.04 | 0.3951 | 0.0019 | 3.4E-7 | 1.7726 | E ↔ X 5 6 R | 27144.71 Z | |||
↳Afaf, 1949; Afaf, 1950; missing citation; missing citation; Weltner and McLeod, 1965; Nicholls and Tyte, 1967; Liszt and Smith, 1971 | ||||||||||||
D 1Δ | y + 19321.5 | [835.4] Z | 2.56 H | 0.3986 | 0.0021 | 3.8E-7 | 1.7648 | D → A R | 19272.55 Z | |||
↳Afaf, 1950, 2; missing citation; missing citation; Nicholls and Tyte, 1967 | ||||||||||||
d 3Δ | x + 22314.9 | 820.6 H | 3.31 | [0.3953] | (0.0021) | [2.4E-7] | 1.7761 | d ↔ a 5 R | 21631.48 Z | |||
↳missing citation; missing citation; Afaf, 1950; missing citation; missing citation; Ortenberg, 1962; Ortenberg and Glasko, 1963; Singh and Pathak, 1967; Nicholls and Tyte, 1967; Schoonveld and Sundaram, 1974 | ||||||||||||
x + 21894.3 | 820.6 H | 3.31 | [0.3926] | (0.0021) | [1.8E-7] | 1.7761 | d ↔ a 5 R | 21548.46 Z | ||||
↳missing citation; missing citation; Afaf, 1950; missing citation; missing citation; Ortenberg, 1962; Ortenberg and Glasko, 1963; Singh and Pathak, 1967; Nicholls and Tyte, 1967; Schoonveld and Sundaram, 1974 | ||||||||||||
x + 21594.3 | 820.6 H | 3.31 | [0.3896] | (0.0021) | [3.5E-7] | 1.7761 | d ↔ a 5 R | 21536.36 Z | ||||
↳missing citation; missing citation; Afaf, 1950; missing citation; missing citation; Ortenberg, 1962; Ortenberg and Glasko, 1963; Singh and Pathak, 1967; Nicholls and Tyte, 1967; Schoonveld and Sundaram, 1974 | ||||||||||||
State | Te | ωe | ωexe | ωeye | Be | αe | γe | De | βe | re | Trans. | ν00 |
c 3Πr | x + 18137.6 | 845.4 HR | 3.64 | [0.4058] 7 | (0.0023) | [3.9E-7] | 1.756 | c ↔ a 5 R | 17466.46 8 Z | |||
↳missing citation; missing citation; missing citation; Nicholls and Tyte, 1967; Lindgren, 1973; Schoonveld and Sundaram, 1974 | ||||||||||||
x + 18079.4 | 845.4 HR | 3.64 | [0.4032] 7 | (0.0023) | [5.0E-7] | 1.756 | c ↔ a 5 R | 17745.89 8 Z | ||||
↳missing citation; missing citation; missing citation; Nicholls and Tyte, 1967; Lindgren, 1973; Schoonveld and Sundaram, 1974 | ||||||||||||
x + 18041.3 | 845.4 HR | 3.64 | [0.3960] 7 | (0.0023) | [2.4E-7] | 1.756 | c ↔ a 5 R | 17995.70 Z | ||||
↳missing citation; missing citation; missing citation; Nicholls and Tyte, 1967; Lindgren, 1973; Schoonveld and Sundaram, 1974 | ||||||||||||
b 3Φr | x + 16700.5 | 853.9 HR | 3.14 | [0.40438] | 0.00191 9 | [3.642E-7] 10 | 1.75143 | b ↔ a 5 R | 16033.81 11 Z | |||
↳missing citation; Tanaka and Horie, 1941; missing citation; missing citation; Ortenberg, 1962; Ortenberg and Glasko, 1963; Nicholls and Tyte, 1967; Singh and Pathak, 1967, 2; missing citation; Tatum and Balfour, 1973; Schoonveld and Sundaram, 1974 | ||||||||||||
x + 16070.4 | 853.9 HR | 3.14 | [0.40368] | 0.00210 9 | [3.617E-7] 10 | 1.75143 | b ← .a 5 R | 15741.31 11 Z | ||||
↳missing citation; Tanaka and Horie, 1941; missing citation; missing citation; Ortenberg, 1962; Ortenberg and Glasko, 1963; Nicholls and Tyte, 1967; Singh and Pathak, 1967, 2; missing citation; Tatum and Balfour, 1973; Schoonveld and Sundaram, 1974 | ||||||||||||
x + 15468.0 | 853.9 HR | 3.14 | [0.40307] | 0.00198 9 | [3.562E-7] 10 | 1.75143 | b ↔ a 5 R | 15426.78 11 Z | ||||
↳missing citation; Tanaka and Horie, 1941; missing citation; missing citation; Ortenberg, 1962; Ortenberg and Glasko, 1963; Nicholls and Tyte, 1967; Singh and Pathak, 1967, 2; missing citation; Tatum and Balfour, 1973; Schoonveld and Sundaram, 1974 | ||||||||||||
State | Te | ωe | ωexe | ωeye | Be | αe | γe | De | βe | re | Trans. | ν00 |
B 1Π | 15443 | 859 12 | 3 | [0.40154] 13 | [3.52E-7] | [1.75832] | B ↔ X 5 6 R | 15383.41 14 Z | ||||
↳Gatterer, Junkes, et al., 1957; Weltner and McLeod, 1965; Balfour and Tatum, 1973 | ||||||||||||
A 1Δ | y | 938.1 H | 1.80 | [0.4167] | (0.0012) | [3.5E-7] | [1.7260] | |||||
a 3Δ | x + 625.5 | 936.5 HR | 3.47 | [0.41573] | [0.00173] 10 | [3.309E-7] | [1.7285] | |||||
x + 287.91 | 936.5 HR | 3.47 | [0.41475] | [0.00190] 10 | [3.269E-7] | [1.7285] | ||||||
x | 936.5 HR | 3.47 | [0.41328] | [0.00178] 10 | [3.169E-7] | [1.7285] | ||||||
X 1Σ+ | 0 | 969.76 Z | 4.90 | [0.42263] | [0.0023] 10 | [3.19E-7] | [1.7116] 15 |

References

Chase, 1998
Chase, M.W., Jr.,
NIST-JANAF Themochemical Tables, Fourth Edition,
J. Phys. Chem. Ref. Data, Monograph 9, 1998, 1-1951. [all data]
Murad and Hildenbrand, 1975
Murad, E.; Hildenbrand, D.L.,
Thermochemical properties of gaseous ZrO and ZrO2,
J. Chem. Phys., 1975, 63, 1133. [all data]
Rauh and Ackermann, 1974
Rauh, E.G.; Ackermann, R.J.,
First ionization potentials of some refractory oxide vapors,
J. Chem. Phys., 1974, 60, 1396. [all data]
Gingerich, 1968
Gingerich, K.A.,
Gaseous metal nitrides. II. The dissociation energy, heat of sublimation, and heat of formation of zirconium mononitride,
J. Chem. Phys., 1968, 49, 14. [all data]
Chupka, Berkowitz, et al., 1957
Chupka, W.A.; Berkowitz, J.; Inghram, M.G.,
Thermodynamics of the Zr-ZrO, system: the dissociation energies of ZrO and ZrO2,
J. Chem. Phys., 1957, 26, 1207. [all data]
Kiess, 1948
Kiess, C.C.,
Red and infrared bands of titanium and zirconium oxides,
Publ. Astron. Soc. Pac., 1948, 60, 252. [all data]
Afaf, 1950
Afaf, M.,
Band-spectrum of ZrO,
Proc. Phys. Soc. London Sect. A, 1950, 63, 1156. [all data]
Akerlind, 1956
Akerlind, L.,
The rotational analysis of the singlet system B of zirconium oxide. The λ 8192 band-system,
Ark. Fys., 1956, 11, 395. [all data]
Meggers and Kiess, 1932
Meggers, W.F.; Kiess, C.C.,
Infra-red arc spectra photographed with xenocyanine,
J. Res. Nat. Bur. Stand. US, 1932, 9, 309. [all data]
Weltner and McLeod, 1965
Weltner, W., Jr.; McLeod, D., Jr.,
Ground state of zirconium monoxide from neon matrix investigations at 4° K,
Nature (London), 1965, 206, 87. [all data]
Afaf, 1949
Afaf, M.,
Band systems of zirconium oxide (ZrO) in the ultra-violet,
Nature (London), 1949, 164, 752. [all data]
Nicholls and Tyte, 1967
Nicholls, R.W.; Tyte, D.C.,
Franck-Condon factors and r centroids for band systems of ZrO,
Proc. Phys. Soc. London, 1967, 91, 489. [all data]
Liszt and Smith, 1971
Liszt, H.S.; Smith, Wm.H.,
RKR Franck-Condon factors for blue and ultraviolet transitions of some metal oxides,
J. Quant. Spectrosc. Radiat. Transfer, 1971, 11, 1043. [all data]
Afaf, 1950, 2
Afaf, M.,
Singlet system B of ZrO,
Proc. Phys. Soc. London Sect. A, 1950, 63, 674. [all data]
Ortenberg, 1962
Ortenberg, F.S.,
Relative intensity of the α- and γ-systems of the ZrO bands,
Sov. Astron. Engl. Transl., 1962, 5, 588. [all data]
Ortenberg and Glasko, 1963
Ortenberg, F.S.; Glasko, V.B.,
Vibrational transition probabilities for band systems of some diatomic oxides,
Sov. Astron. Engl. Transl., 1963, 6, 714, In original 601. [all data]
Singh and Pathak, 1967
Singh, P.D.; Pathak, A.N.,
Franck-Condon factors and r centroids for the C → X band system of ZrO,
Proc. Phys. Soc. London, 1967, 90, 543. [all data]
Schoonveld and Sundaram, 1974
Schoonveld, L.; Sundaram, S.,
Electronic transitions of the ZrO molecule: triplet systems,
Astrophys. J., 1974, 192, 207. [all data]
Lindgren, 1973
Lindgren, B.,
Determination of the triplet splitting in the ZrO molecule,
J. Mol. Spectrosc., 1973, 48, 322. [all data]
Tanaka and Horie, 1941
Tanaka, T.; Horie, T.,
Rotational analysis of γ system of ZrO bands,
Proc. Phys. Math. Soc. Jpn., 1941, 23, 464. [all data]
Singh and Pathak, 1967, 2
Singh, P.D.; Pathak, A.N.,
Vibrational transition probabilities and r centroids of the A → X band system of ZrO,
Proc. Phys. Soc. London, 1967, 91, 497. [all data]
Tatum and Balfour, 1973
Tatum, J.B.; Balfour, W.J.,
The rotational analysis of the gamma system (A3Φ - X'3Δ) of the spectrum of zirconium oxide,
J. Mol. Spectrosc., 1973, 48, 292. [all data]
Gatterer, Junkes, et al., 1957
Gatterer, A.; Junkes, J.; Salpeter, E.W.,
Molecular spectra of metallic oxides, Specola Vaticana, Citta del Vaticano, 1957, 0. [all data]
Balfour and Tatum, 1973
Balfour, W.J.; Tatum, J.B.,
The rotational analysis of the 1Π-X1Σ+ system at 649.5 nanometers of zirconium oxide,
J. Mol. Spectrosc., 1973, 48, 313. [all data]
Davis, 1947
Davis, D.N.,
The spectrum of β pegasi,
Astrophys. J., 1947, 106, 28. [all data]
Herbig, 1949
Herbig, G.H.,
Identification of a molecular band at λ3682 in the spectra of late-type stars,
Astrophys. J., 1949, 109, 109. [all data]
Davis and Keenan, 1969
Davis, D.N.; Keenan, P.C.,
Is there NbO in S-type stars?,
Publ. Astron. Soc. Pac., 1969, 81, 230. [all data]
Brewer and Rosenblatt, 1969
Brewer, L.; Rosenblatt, G.M.,
Dissociation energies and free energy functions of gaseous monoxides,
Adv. High Temp. Chem., 1969, 2, 1. [all data]
Ackermann and Rauh, 1974
Ackermann, R.J.; Rauh, E.G.,
Thermodynamic properties of ZrO (g) and HfO (g); a critical examination of isomolecular oxygen-exchange reactions,
J. Chem. Phys., 1974, 60, 2266. [all data]
Veits, Gurvich, et al., 1974
Veits, I.V.; Gurvich, L.V.; Kobylyanskii, A.I.; Smirnov, A.D.; Suslov, A.A.,
Determination of the relative position of noncombining electronic states of diatomic molecules. Ground electronic state of ZrO,
J. Quant. Spectrosc. Radiat. Transfer, 1974, 14, 221. [all data]