vanadium oxide
- Formula: OV
- Molecular weight: 66.9409
- IUPAC Standard InChIKey: IBYSTTGVDIFUAY-UHFFFAOYSA-N
- CAS Registry Number: 12035-98-2
- Chemical structure:
View 3d structure (requires JavaScript / HTML 5) - Other names: Vanadium monoxide

Condensed phase thermochemistry data

Quantity | Value | Units | Method | Reference | Comment |
---|---|---|---|---|---|
ΔfH°liquid | -370.90 | kJ/mol | Review | Chase, 1998 | Data last reviewed in December, 1973 |
Quantity | Value | Units | Method | Reference | Comment |
S°liquid,1 bar | 69.17 | J/mol*K | Review | Chase, 1998 | Data last reviewed in December, 1973 |
Quantity | Value | Units | Method | Reference | Comment |
ΔfH°solid | -431.79 | kJ/mol | Review | Chase, 1998 | Data last reviewed in December, 1973 |
Quantity | Value | Units | Method | Reference | Comment |
S°solid | 39.10 | J/mol*K | Review | Chase, 1998 | Data last reviewed in December, 1973 |
Liquid Phase Heat Capacity (Shomate Equation)
Cp° = A + B*t + C*t2 + D*t3 +
E/t2
H° − H°298.15= A*t + B*t2/2 +
C*t3/3 + D*t4/4 − E/t + F − H
S° = A*ln(t) + B*t + C*t2/2 + D*t3/3 −
E/(2*t2) + G
Cp = heat capacity (J/mol*K)
H° = standard enthalpy (kJ/mol)
S° = standard entropy (J/mol*K)
t = temperature (K) / 1000.
View plot Requires a JavaScript / HTML 5 canvas capable browser.
Temperature (K) | 2063. to 3500. |
---|---|
A | 62.76000 |
B | 4.499809×10-8 |
C | -1.533232×10-8 |
D | 1.784698×10-9 |
E | 1.832070×10-8 |
F | -395.7675 |
G | 132.9328 |
H | -370.9016 |
Reference | Chase, 1998 |
Comment | Data last reviewed in December, 1973 |
Solid Phase Heat Capacity (Shomate Equation)
Cp° = A + B*t + C*t2 + D*t3 +
E/t2
H° − H°298.15= A*t + B*t2/2 +
C*t3/3 + D*t4/4 − E/t + F − H
S° = A*ln(t) + B*t + C*t2/2 + D*t3/3 −
E/(2*t2) + G
Cp = heat capacity (J/mol*K)
H° = standard enthalpy (kJ/mol)
S° = standard entropy (J/mol*K)
t = temperature (K) / 1000.
View plot Requires a JavaScript / HTML 5 canvas capable browser.
Temperature (K) | 298. to 2063. |
---|---|
A | 45.97044 |
B | 14.46601 |
C | 0.619521 |
D | -0.177508 |
E | -0.420735 |
F | -447.5290 |
G | 88.02508 |
H | -431.7888 |
Reference | Chase, 1998 |
Comment | Data last reviewed in December, 1973 |

Gas phase ion energetics data

Data compiled as indicated in comments:
LL - Sharon G. Lias and Joel F. Liebman
LBLHLM - Sharon G. Lias, John E. Bartmess, Joel F. Liebman, John L. Holmes, Rhoda D. Levin, and W. Gary Mallard
LLK - Sharon G. Lias, Rhoda D. Levin, and Sherif A. Kafafi
B - John E. Bartmess
Electron affinity determinations
EA (eV) | Method | Reference | Comment |
---|---|---|---|
1.2290 ± 0.0080 | LPES | Wu and Wang, 1998 | B |
Ionization energy determinations
IE (eV) | Method | Reference | Comment |
---|---|---|---|
7.2386 ± 0.0006 | TE | Harrington and Weisshaar, 1992 | LL |
7.5 | DER | Lias, Bartmess, et al., 1988 | LL |
8.4 | EI | Balducci, Gigli, et al., 1983 | LBLHLM |
8. ± 1. | EI | Farber, Uy, et al., 1972 | LLK |

Gas phase thermochemistry data

Quantity | Value | Units | Method | Reference | Comment |
---|---|---|---|---|---|
ΔfH°gas | 127.61 | kJ/mol | Review | Chase, 1998 | Data last reviewed in December, 1973 |
Quantity | Value | Units | Method | Reference | Comment |
S°gas,1 bar | 230.90 | J/mol*K | Review | Chase, 1998 | Data last reviewed in December, 1973 |
Gas Phase Heat Capacity (Shomate Equation)
Cp° = A + B*t + C*t2 + D*t3 +
E/t2
H° − H°298.15= A*t + B*t2/2 +
C*t3/3 + D*t4/4 − E/t + F − H
S° = A*ln(t) + B*t + C*t2/2 + D*t3/3 −
E/(2*t2) + G
Cp = heat capacity (J/mol*K)
H° = standard enthalpy (kJ/mol)
S° = standard entropy (J/mol*K)
t = temperature (K) / 1000.
View plot Requires a JavaScript / HTML 5 canvas capable browser.
Temperature (K) | 3500. to 6000. |
---|---|
A | 44.16923 |
B | -6.802305 |
C | 2.368241 |
D | -0.191252 |
E | -3.325443 |
F | 106.9112 |
G | 275.8377 |
H | 127.6120 |
Reference | Chase, 1998 |
Comment | Data last reviewed in December, 1973 |

References

Chase, 1998
Chase, M.W., Jr.,
NIST-JANAF Themochemical Tables, Fourth Edition,
J. Phys. Chem. Ref. Data, Monograph 9, 1998, 1-1951. [all data]
Wu and Wang, 1998
Wu, H.; Wang, L.-S.,
A Photoelectron Spectroscopic Study of Monovanadium Oxide Anions (VOx-, x=1-4),
J. Phys. Chem., 1998, 108, 13, 5310, https://doi.org/10.1063/1.475966
. [all data]
Harrington and Weisshaar, 1992
Harrington, J.; Weisshaar, J.C.,
State-to-state photoionization of VO: Propensity for large positive changes in rotational quantum number,
J. Chem. Phys., 1992, 97, 2809. [all data]
Lias, Bartmess, et al., 1988
Lias, S.G.; Bartmess, J.E.; Liebman, J.F.; Holmes, J.L.; Levin, R.D.; Mallard, W.G.,
Gas-phase ion and neutral thermochemistry,
J. Phys. Chem. Ref. Data, Suppl. 1, 1988, 17, 1-861. [all data]
Balducci, Gigli, et al., 1983
Balducci, G.; Gigli, G.; Guido, M.,
Thermodynamic study of gaseous ternary oxide molecules. The europium-vanadium-oxygen system,
J. Chem. Phys., 1983, 79, 5623. [all data]
Farber, Uy, et al., 1972
Farber, M.; Uy, O.M.; Srivastava, R.D.,
Effusion-mass spectrometric determination of the heats of formation of the gaseous molecules V4O10, V4O8, VO2, and VO,
J. Chem. Phys., 1972, 56, 5312. [all data]