niobium oxide
- Formula: NbO
- Molecular weight: 108.9058
- IUPAC Standard InChIKey: BFRGSJVXBIWTCF-UHFFFAOYSA-N
- CAS Registry Number: 12034-57-0
- Chemical structure:
View 3d structure (requires JavaScript / HTML 5) - Other names: Niobium monoxide

Gas phase thermochemistry data

Quantity | Value | Units | Method | Reference | Comment |
---|---|---|---|---|---|
ΔfH°gas | 47.500 | kcal/mol | Review | Chase, 1998 | Data last reviewed in December, 1973 |
Quantity | Value | Units | Method | Reference | Comment |
S°gas,1 bar | 57.091 | cal/mol*K | Review | Chase, 1998 | Data last reviewed in December, 1973 |
Gas Phase Heat Capacity (Shomate Equation)
Cp° = A + B*t + C*t2 + D*t3 +
E/t2
H° − H°298.15= A*t + B*t2/2 +
C*t3/3 + D*t4/4 − E/t + F − H
S° = A*ln(t) + B*t + C*t2/2 + D*t3/3 −
E/(2*t2) + G
Cp = heat capacity (cal/mol*K)
H° = standard enthalpy (kcal/mol)
S° = standard entropy (cal/mol*K)
t = temperature (K) / 1000.
View plot Requires a JavaScript / HTML 5 canvas capable browser.
Temperature (K) | 3000. to 6000. |
---|---|
A | 8.540225 |
B | 0.191408 |
C | 0.005594 |
D | 0.004413 |
E | -0.122152 |
F | 44.52940 |
G | 66.68212 |
H | 47.50000 |
Reference | Chase, 1998 |
Comment | Data last reviewed in December, 1973 |

Condensed phase thermochemistry data

Quantity | Value | Units | Method | Reference | Comment |
---|---|---|---|---|---|
ΔfH°liquid | -80.483 | kcal/mol | Review | Chase, 1998 | Data last reviewed in December, 1973 |
Quantity | Value | Units | Method | Reference | Comment |
S°liquid,1 bar | 19.89 | cal/mol*K | Review | Chase, 1998 | Data last reviewed in December, 1973 |
Quantity | Value | Units | Method | Reference | Comment |
ΔfH°solid | -100.30 | kcal/mol | Review | Chase, 1998 | Data last reviewed in December, 1973 |
Quantity | Value | Units | Method | Reference | Comment |
S°solid | 11.00 | cal/mol*K | Review | Chase, 1998 | Data last reviewed in December, 1973 |
Liquid Phase Heat Capacity (Shomate Equation)
Cp° = A + B*t + C*t2 + D*t3 +
E/t2
H° − H°298.15= A*t + B*t2/2 +
C*t3/3 + D*t4/4 − E/t + F − H
S° = A*ln(t) + B*t + C*t2/2 + D*t3/3 −
E/(2*t2) + G
Cp = heat capacity (cal/mol*K)
H° = standard enthalpy (kcal/mol)
S° = standard entropy (cal/mol*K)
t = temperature (K) / 1000.
View plot Requires a JavaScript / HTML 5 canvas capable browser.
Temperature (K) | 2210. to 3000. |
---|---|
A | 14.99952 |
B | 0.000373 |
C | -0.000108 |
D | 0.000011 |
E | 0.000321 |
F | -88.60086 |
G | 32.44073 |
H | -80.48351 |
Reference | Chase, 1998 |
Comment | Data last reviewed in December, 1973 |
Solid Phase Heat Capacity (Shomate Equation)
Cp° = A + B*t + C*t2 + D*t3 +
E/t2
H° − H°298.15= A*t + B*t2/2 +
C*t3/3 + D*t4/4 − E/t + F − H
S° = A*ln(t) + B*t + C*t2/2 + D*t3/3 −
E/(2*t2) + G
Cp = heat capacity (cal/mol*K)
H° = standard enthalpy (kcal/mol)
S° = standard entropy (cal/mol*K)
t = temperature (K) / 1000.
View plot Requires a JavaScript / HTML 5 canvas capable browser.
Temperature (K) | 298. to 2210. |
---|---|
A | 10.27806 |
B | 2.114613 |
C | 0.004440 |
D | -0.001371 |
E | -0.096227 |
F | -103.7813 |
G | 22.26568 |
H | -100.3000 |
Reference | Chase, 1998 |
Comment | Data last reviewed in December, 1973 |

Gas phase ion energetics data

Data compiled as indicated in comments:
LBLHLM - Sharon G. Lias, John E. Bartmess, Joel F. Liebman, John L. Holmes, Rhoda D. Levin, and W. Gary Mallard
Ionization energy determinations
IE (eV) | Method | Reference | Comment |
---|---|---|---|
7.91 ± 0.02 | PE | Dyke, Ellis, et al., 1987 | LBLHLM |
7.0 ± 0.5 | EI | Balducci, Gigli, et al., 1987 | LBLHLM |

Constants of diatomic molecules

Data compiled by: Klaus P. Huber and Gerhard H. Herzberg

Data collected through October, 1975

Symbols used in the table of constants
SymbolMeaning
State electronic state and / or symmetry symbol
Te minimum electronic energy (cm-1)
ωe vibrational constant – first term (cm-1)
ωexe vibrational constant – second term (cm-1)
ωeye vibrational constant – third term (cm-1)
Be rotational constant in equilibrium position (cm-1)
αe rotational constant – first term (cm-1)
γe rotation-vibration interaction constant (cm-1)
De centrifugal distortion constant (cm-1)
βe rotational constant – first term, centrifugal force (cm-1)
re internuclear distance (Å)
Trans. observed transition(s) corresponding to electronic state
ν00 position of 0-0 band (units noted in table)
Diatomic constants for 93Nb16O
StateTeωeωexeωeyeBeαeγeDeβereTrans.ν00
G 4Σ- 1 21385.3 850.5 Z 3.37  0.4001 1 0.0019  2.7E-7  1.7572 G ↔ X R 21316.2 Z
Rao, 1950; missing citation; missing citation; missing citation; Singh and Shukla, 1972; Brom, Durham, et al., 1974
F (20740) (908) 2 (4)        F ← X 2 (20704)
Brom, Durham, et al., 1974
D (16640) [(932)] 3         D ← X 3 (16618)
Brom, Durham, et al., 1974
C (15580) (904) 3 (2)        C ← X 3 (15544)
Green, Korfmacher, et al., 1973; Brom, Durham, et al., 1974
StateTeωeωexeωeyeBeαeγeDeβereTrans.ν00
B (15300) (891) 3 (4)        B ← X 3 (15256)
Brom, Durham, et al., 1974
E (15270) (847) 3         E ← X 3 (15206)
Brom, Durham, et al., 1974
A'           A' ← X 3 (14467)
Brom, Durham, et al., 1974
(13720) [(899)] 3         A ← X 3 (13676)
Brom, Durham, et al., 1974
StateTeωeωexeωeyeBeαeγeDeβereTrans.ν00
X 4Σ- 0 1 989.0 Z 3.83  0.4321 1 0.0021  2.2E-7  1.6909 4
Green, Korfmacher, et al., 1973; Brom, Durham, et al., 1974

References

Chase, 1998
Chase, M.W., Jr.,
NIST-JANAF Themochemical Tables, Fourth Edition,
J. Phys. Chem. Ref. Data, Monograph 9, 1998, 1-1951. [all data]
Dyke, Ellis, et al., 1987
Dyke, J.M.; Ellis, A.M.; Feher, M.; Morris, A.; Paul, A.J.; Stevens, J.C.H.,
High-temperature photoelectron spectroscopy - A study of niobium monoxide and tantalum monoxide,
J. Chem. Soc. Faraday Trans. 2, 1987, 83, 1555. [all data]
Balducci, Gigli, et al., 1987
Balducci, G.; Gigli, G.; Guido, M.,
Thermochemical study of the gaseous molecules EuNbO3, EuNbO2, EuNb2O6 and of the niobium oxides NbO and NbO2,
Ber. Bunsen-Ges. Phys. Chem., 1987, 91, 635. [all data]