Mononitrogen monosulfide
- Formula: NS
- Molecular weight: 46.072
- IUPAC Standard InChIKey: QXTCFDCJXWLNAP-UHFFFAOYSA-N
- CAS Registry Number: 12033-56-6
- Chemical structure:
View 3d structure (requires JavaScript / HTML 5) - Permanent link for this species. Use this link for bookmarking this species for future reference.

Gas phase thermochemistry data

Quantity | Value | Units | Method | Reference | Comment |
---|---|---|---|---|---|
ΔfH°gas | 263.59 | kJ/mol | Review | Chase, 1998 | Data last reviewed in June, 1961 |
Quantity | Value | Units | Method | Reference | Comment |
S°gas,1 bar | 222.09 | J/mol*K | Review | Chase, 1998 | Data last reviewed in June, 1961 |
Gas Phase Heat Capacity (Shomate Equation)
Cp° = A + B*t + C*t2 + D*t3 +
E/t2
H° − H°298.15= A*t + B*t2/2 +
C*t3/3 + D*t4/4 − E/t + F − H
S° = A*ln(t) + B*t + C*t2/2 + D*t3/3 −
E/(2*t2) + G
Cp = heat capacity (J/mol*K)
H° = standard enthalpy (kJ/mol)
S° = standard entropy (J/mol*K)
t = temperature (K) / 1000.
View plot Requires a JavaScript / HTML 5 canvas capable browser.
Temperature (K) | 298. to 1000. | 1000. to 6000. |
---|---|---|
A | 21.05426 | 36.97991 |
B | 34.54248 | 0.500026 |
C | -28.48162 | -0.051749 |
D | 8.680881 | 0.003644 |
E | 0.243790 | -1.403921 |
F | 256.8319 | 248.9723 |
G | 239.8286 | 261.7243 |
H | 263.5924 | 263.5924 |
Reference | Chase, 1998 | Chase, 1998 |
Comment | Data last reviewed in June, 1961 | Data last reviewed in June, 1961 |

Gas phase ion energetics data

Data compiled as indicated in comments:
LLK - Sharon G. Lias, Rhoda D. Levin, and Sherif A. Kafafi
RDSH - Henry M. Rosenstock, Keith Draxl, Bruce W. Steiner, and John T. Herron
B - John E. Bartmess
Electron affinity determinations
EA (eV) | Method | Reference | Comment |
---|---|---|---|
1.194 ± 0.011 | LPES | Burnett, Feigerle, et al., 1982 | B |
Ionization energy determinations
IE (eV) | Method | Reference | Comment |
---|---|---|---|
9.85 ± 0.28 | DER | O'Hare, 1970 | RDSH |
8.87 ± 0.01 | PE | Dyke, Morris, et al., 1977 | Vertical value; LLK |

Constants of diatomic molecules

Data compiled by: Klaus P. Huber and Gerhard H. Herzberg
Data collected through May, 1977
Symbol | Meaning |
---|---|
State | electronic state and / or symmetry symbol |
Te | minimum electronic energy (cm-1) |
ωe | vibrational constant – first term (cm-1) |
ωexe | vibrational constant – second term (cm-1) |
ωeye | vibrational constant – third term (cm-1) |
Be | rotational constant in equilibrium position (cm-1) |
αe | rotational constant – first term (cm-1) |
γe | rotation-vibration interaction constant (cm-1) |
De | centrifugal distortion constant (cm-1) |
βe | rotational constant – first term, centrifugal force (cm-1) |
re | internuclear distance (Å) |
Trans. | observed transition(s) corresponding to electronic state |
ν00 | position of 0-0 band (units noted in table) |
State | Te | ωe | ωexe | ωeye | Be | αe | γe | De | βe | re | Trans. | ν00 |
---|---|---|---|---|---|---|---|---|---|---|---|---|
Theoretical potential curves for most of the observed valence states have been calculated by Bialski and Grein, 1976. | ||||||||||||
F 2Δ | [0.8367] 1 | [1.05E-6] | [1.4384] | F → X V | 55959.8 Z | |||||||
↳Joshi, 1966; missing citation | ||||||||||||
56181.3 Z | ||||||||||||
↳Joshi, 1966; missing citation | ||||||||||||
J 2Σ+ | [(0.825)] 2 | [(1.449)] | J → X V | 55562 | ||||||||
↳Vervloet and Jenouvrier, 1976 | ||||||||||||
55784 | ||||||||||||
State | Te | ωe | ωexe | ωeye | Be | αe | γe | De | βe | re | Trans. | ν00 |
E 2Πr | 3 | [0.821] 3 | [1.452] | E → X | 51154 3 | |||||||
↳Joshi, 1966; missing citation | ||||||||||||
51330 3 | ||||||||||||
I 2Σ+ | (44400) | [1008] | [0.6940] 4 | [5E-6] | [1.5793] | I → X R | 44050.1 Z | |||||
↳missing citation; Joshi, 1966; Narasimham and Subramanian, 1969; missing citation; Vervloet and Jenouvrier, 1976 | ||||||||||||
44271.6 Z | ||||||||||||
H 2Πi | (44049) 5 | 767.6 | 5.0 | [0.5972] 6 | 0.0059 | [1.75E-6] | 1.702 | H → X R | 43824.6 Z | |||
↳missing citation; Jenouvrier and Pascat, 1973; Vervloet and Jenouvrier, 1976 | ||||||||||||
43876 | 767.6 | 5.0 | [0.5915] 6 | 0.0059 | 1.702 | H → X R | 43429.6 Z | |||||
↳missing citation; Jenouvrier and Pascat, 1973; Vervloet and Jenouvrier, 1976 | ||||||||||||
State | Te | ωe | ωexe | ωeye | Be | αe | γe | De | βe | re | Trans. | ν00 |
C 2Σ+ | 43290 | [1389] | 7 | [0.8275] | 7 | [1.2E-6] | [1.4464] | C ↔ X 8 9 V | 43165.9 Z | |||
↳Fowler and Bakker, 1932; missing citation; Barrow, Downie, et al., 1952; missing citation; Narasimham and Subramanian, 1969; missing citation; missing citation | ||||||||||||
43387.4 Z | ||||||||||||
↳Fowler and Bakker, 1932; missing citation; Barrow, Downie, et al., 1952; missing citation; Narasimham and Subramanian, 1969; missing citation; missing citation | ||||||||||||
G 2Σ- | 43346 | [879.8] Z | [0.6905] 10 | 11 | [2.5E-6] | [1.5834] | G → X R | 42956.8 Z | ||||
↳missing citation | ||||||||||||
43178.3 Z | ||||||||||||
↳missing citation | ||||||||||||
State | Te | ωe | ωexe | ωeye | Be | αe | γe | De | βe | re | Trans. | ν00 |
A 2Δr | (40046) | [934.4] Z | 12 | 12 | 12 | A ↔ X 9 R | 39688.1 Z | |||||
↳Fowler and Bakker, 1932; Barrow, Drummond, et al., 1954; missing citation; Narasimham and Subramanian, 1969; missing citation | ||||||||||||
40005 | [943.9] Z | 8.4 H | [0.6850] | 12 | [1.5897] | 39875.7 Z | ||||||
↳Fowler and Bakker, 1932; Barrow, Drummond, et al., 1954; missing citation; Narasimham and Subramanian, 1969; missing citation | ||||||||||||
B' 2Σ+ | (36255) | (1060) | (15) | (0.78) 13 | (1.49) | B' → X | (35952) 13 | |||||
↳Narasimham, Raghuveer, et al., 1975; Jenouvrier and Daumont, 1976 | ||||||||||||
(36174) 13 | ||||||||||||
↳Narasimham, Raghuveer, et al., 1975; Jenouvrier and Daumont, 1976 | ||||||||||||
State | Te | ωe | ωexe | ωeye | Be | αe | γe | De | βe | re | Trans. | ν00 |
B 2Πr | 30384.1 | 798.78 Z | 3.59 | 0.6013 14 | 0.0046 | 1.3E-6 | 1.697 | B → X R | 29953.6 Z | |||
↳Narasimham and Srikameswaran, 1963; Smith and Meyer, 1964; missing citation; Goudmand and Dessaux, 1967; missing citation; Vidal, Dessaux, et al., 1969; missing citation | ||||||||||||
30294.9 | 797.31 Z | 3.72 | 0.5962 14 | 0.0048 | 1.3E-6 | B → X R | 30085.1 Z | |||||
↳Narasimham and Srikameswaran, 1963; Smith and Meyer, 1964; missing citation; Goudmand and Dessaux, 1967; missing citation; Vidal, Dessaux, et al., 1969; missing citation | ||||||||||||
X 2Πr | 221.5 15 | 1218.7 Z | 7.28 | [0.775156] 16 | 0.00635 | 1.2E-6 | 1.49402 17 | |||||
↳Amano, Saito, et al., 1969 | ||||||||||||
0 | [0.769602] 16 | 18 | ||||||||||
↳Carrington and Levy, 1966; Carrington, Howard, et al., 1968; Uehara and Morino, 1969 |

References

Chase, 1998
Chase, M.W., Jr.,
NIST-JANAF Themochemical Tables, Fourth Edition,
J. Phys. Chem. Ref. Data, Monograph 9, 1998, 1-1951. [all data]
Burnett, Feigerle, et al., 1982
Burnett, S.M.; Feigerle, C.S.; Stevens, A.E.; Lineberger, C.W.,
Photoelectron spectroscopy of CS- and NS-,
J. Phys. Chem., 1982, 86, 4486. [all data]
O'Hare, 1970
O'Hare, P.A.G.,
Dissociation energies, enthalpies of formation, ionization potentials, and dipole moments of NS and NS+,
J. Chem. Phys., 1970, 52, 2992. [all data]
Dyke, Morris, et al., 1977
Dyke, J.M.; Morris, A.; Trickle, I.R.,
Characterization of the ground ionic state of the NS molecule using photoelectron spectroscopy,
J. Chem. Soc. Faraday Trans. 2, 1977, 73, 147. [all data]