Disilicon mononitride monoxide
- Formula: NOSi2
- Molecular weight: 86.1771
- IUPAC Standard InChIKey: LTBAZFOZCZIHRG-UHFFFAOYSA-N
- CAS Registry Number: 12033-47-5
- Chemical structure:
View 3d structure (requires JavaScript / HTML 5) - Permanent link for this species. Use this link for bookmarking this species for future reference.

Gas phase ion energetics data

Data compiled by: Sharon G. Lias, Rhoda D. Levin, and Sherif A. Kafafi
Ionization energy determinations
IE (eV) | Method | Reference |
---|---|---|
10.8 ± 0.5 | EI | Muenow, 1973 |

References

Muenow, 1973
Muenow, D.W.,
Mass spectrometric evidence for the gaseous silicon oxide nitride molecule and its heat of atomizaton,
J. Phys. Chem., 1973, 77, 970. [all data]