Lanthanum monoxide
- Formula: LaO
- Molecular weight: 154.9049
- IUPAC Standard InChIKey: KCPAGCNHGFPBFR-UHFFFAOYSA-N
- CAS Registry Number: 12031-20-8
- Chemical structure:
View 3d structure (requires JavaScript / HTML 5) - Permanent link for this species. Use this link for bookmarking this species for future reference.

Gas phase ion energetics data

Data compiled as indicated in comments:
LLK - Sharon G. Lias, Rhoda D. Levin, and Sherif A. Kafafi
RDSH - Henry M. Rosenstock, Keith Draxl, Bruce W. Steiner, and John T. Herron
Ionization energy determinations
IE (eV) | Method | Reference | Comment |
---|---|---|---|
4.9 ± 0.1 | EI | Rauh and Ackermann, 1975 | LLK |
5.0 ± 0.1 | EI | Rauh and Ackermann, 1974 | LLK |
5.2 | EI | Neubert and Zmbov, 1974 | LLK |
~5. | EI | Cater, Lee, et al., 1965 | RDSH |
4.8 ± 0.5 | EI | Chupka, Inghram, et al., 1956 | RDSH |

References

Rauh and Ackermann, 1975
Rauh, E.G.; Ackermann, R.J.,
The first ionization potentials of neptunium and neptunium monoxide,
J. Chem. Phys., 1975, 62, 1584. [all data]
Rauh and Ackermann, 1974
Rauh, E.G.; Ackermann, R.J.,
First ionization potentials of some refractory oxide vapors,
J. Chem. Phys., 1974, 60, 1396. [all data]
Neubert and Zmbov, 1974
Neubert, A.; Zmbov, K.F.,
Mass spectrometric determination of the dissociation energy of the ThO molecule,
High Temp. Sci., 1974, 6, 303. [all data]
Cater, Lee, et al., 1965
Cater, E.D.; Lee, T.E.; Johnson, E.W.; Rauh, E.G.; Eick, H.A.,
Vaporization, thermodynamics, and dissociation energy of lanthanum monosulfide,
J. Phys. Chem., 1965, 69, 2684. [all data]
Chupka, Inghram, et al., 1956
Chupka, W.A.; Inghram, M.G.; Porter, R.F.,
Dissociation energy of gaseous LaO,
J. Chem. Phys., 1956, 24, 792. [all data]