iridium dioxide
- Formula: IrO2
- Molecular weight: 224.216
- IUPAC Standard InChIKey: HTXDPTMKBJXEOW-UHFFFAOYSA-N
- CAS Registry Number: 12030-49-8
- Chemical structure:
View 3d structure (requires JavaScript / HTML 5) - Permanent link for this species. Use this link for bookmarking this species for future reference.

Gas phase ion energetics data

Data compiled by: Henry M. Rosenstock, Keith Draxl, Bruce W. Steiner, and John T. Herron
Ionization energy determinations
IE (eV) | Method | Reference |
---|---|---|
10.9 | EI | Norman, Staley, et al., 1965 |
Appearance energy determinations
Ion | AE (eV) | Other Products | Method | Reference | Comment |
---|---|---|---|---|---|
Ir+ | 13.1 | ? | EI | Norman, Staley, et al., 1965 | |
IrO+ | 15.1 | O | EI | Norman, Staley, et al., 1965 |

References

Norman, Staley, et al., 1965
Norman, J.H.; Staley, H.G.; Bell, W.E.,
Massspectrometric study of gaseous oxides of iridium,
J. Chem. Phys., 1965, 42, 1123. [all data]