diindium trisulphide

Gas phase ion energetics data

Data compiled by: Henry M. Rosenstock, Keith Draxl, Bruce W. Steiner, and John T. Herron

Ionization energy determinations

IE (eV) Method Reference
6.4 ± 0.5EIColin and Drowart, 1968

References

Colin and Drowart, 1968
Colin, R.; Drowart, J., Mass spectrometric determination of dissociation energies of gaseous indium sulphides, selenides and tellurides, J. Chem. Soc. Faraday Trans., 1968, 64, 2611. [all data]