Hafnium monoxide
- Formula: HfO
- Molecular weight: 194.49
- IUPAC Standard InChIKey: SONXPDDOCAOTOE-UHFFFAOYSA-N
- CAS Registry Number: 12029-22-0
- Chemical structure:
View 3d structure (requires JavaScript / HTML 5) - Permanent link for this species. Use this link for bookmarking this species for future reference.

Gas phase ion energetics data

Data compiled as indicated in comments:
LLK - Sharon G. Lias, Rhoda D. Levin, and Sherif A. Kafafi
Ionization energy determinations
IE (eV) | Method | Reference | Comment |
---|---|---|---|
7.6 ± 0.1 | EI | Rauh and Ackermann, 1974 | LLK |

Constants of diatomic molecules

Data compiled by: Klaus P. Huber and Gerhard H. Herzberg
Data collected through January, 1975
Symbol | Meaning |
---|---|
State | electronic state and / or symmetry symbol |
Te | minimum electronic energy (cm-1) |
ωe | vibrational constant – first term (cm-1) |
ωexe | vibrational constant – second term (cm-1) |
ωeye | vibrational constant – third term (cm-1) |
Be | rotational constant in equilibrium position (cm-1) |
αe | rotational constant – first term (cm-1) |
γe | rotation-vibration interaction constant (cm-1) |
De | centrifugal distortion constant (cm-1) |
βe | rotational constant – first term, centrifugal force (cm-1) |
re | internuclear distance (Å) |
Trans. | observed transition(s) corresponding to electronic state |
ν00 | position of 0-0 band (units noted in table) |
State | Te | ωe | ωexe | ωeye | Be | αe | γe | De | βe | re | Trans. | ν00 |
---|---|---|---|---|---|---|---|---|---|---|---|---|
J | [0.3719] 1 2 | [1.7567] | J → x3 1 R | 22655.82 Z | ||||||||
↳missing citation; Weltner and McLeod, 1965; Edvinsson and Nylen, 1971 | ||||||||||||
H | [0.3699] 1 2 | [1.7614] | H → x2 1 R | 21239.87 Z | ||||||||
↳missing citation; Edvinsson and Nylen, 1971 | ||||||||||||
C | x1 + 19719.3 | 852.5 HQ | 4.1 | [0.3696] 1 | [3.0E-7] | [1.7621] | C → x1 1 R | 19682.94 Z | ||||
↳missing citation; Edvinsson and Nylen, 1971 | ||||||||||||
x3 | (945) 3 | (5) | [0.3788] 1 | [2.6E-07] | [1.7406] | |||||||
State | Te | ωe | ωexe | ωeye | Be | αe | γe | De | βe | re | Trans. | ν00 |
x2 | [0.3781] 1 | [2.6E-7] | [1.7422] | |||||||||
x1 | x1 | 925.0 HQ | 3.5 | [0.3776] 1 | [2.8E-7] | [1.7433] | ||||||
G 1Σ(+) | 30090.0 | [852.29] Z | (3.71) | 0.370106 | 0.002071 | [2.764E-7] 4 | 1.760904 | G ↔ X 5 R | 30032.71 Z | |||
↳missing citation; Weltner and McLeod, 1965; Edvinsson and Nylen, 1971 | ||||||||||||
F 1Σ(+) | 27413.59 | 849.40 Z | 3.67 | 0.36563 | 0.00188 | 2.702E-7 | 2.3E-09 | 1.77165 | F ↔ X 5 R | 27351.14 Z | ||
↳missing citation; Weltner and McLeod, 1965; missing citation | ||||||||||||
E 1Π | 25230.94 | 866.93 Z 6 | 3.68 | 0.36928 7 8 | 0.00198 | 2.69E-7 | 1.7636 | E ↔ X 5 R | 25177.25 6 Z | |||
↳missing citation; Weltner and McLeod, 1965; Edvinsson and Nylen, 1971; Wentink and Spindler, 1972 | ||||||||||||
0.36868 9 8 | 0.00197 | 2.67E-7 | E ↔ X 5 R | 25177.25 6 Z | ||||||||
↳missing citation; Weltner and McLeod, 1965; Edvinsson and Nylen, 1971; Wentink and Spindler, 1972 | ||||||||||||
State | Te | ωe | ωexe | ωeye | Be | αe | γe | De | βe | re | Trans. | ν00 |
D 1Π | 23554.41 | 872.60 Z 6 | 3.31 | 0.36912 9 8 | 0.00182 | 2.624E-7 | 3.2E-09 | 1.7642 | D ↔ X 5 R | 23503.65 6 Z | ||
↳missing citation; Weltner and McLeod, 1965; missing citation; Wentink and Spindler, 1972 | ||||||||||||
0.36837 7 8 | 0.001800 | 2.631E-7 | 1.9E-09 | D ↔ X 5 R | 23503.65 6 Z | |||||||
↳missing citation; Weltner and McLeod, 1965; missing citation; Wentink and Spindler, 1972 | ||||||||||||
B 1Π 10 | 17562.22 | 907.01 Z 6 | 3.38 | 0.378060 9 | 0.001852 | 2.63E-7 | 1.7429 | B ↔ X 5 R | 17528.65 6 Z | |||
↳missing citation; Weltner and McLeod, 1965; Edvinsson, 1966; Edvinsson and Nylen, 1971; Wentink and Spindler, 1972 | ||||||||||||
0.377537 7 | 0.001848 | 2.618E-7 | 9E-10 | B ↔ X 5 R | 17528.65 6 Z | |||||||
↳missing citation; Weltner and McLeod, 1965; Edvinsson, 1966; Edvinsson and Nylen, 1971; Wentink and Spindler, 1972 | ||||||||||||
State | Te | ωe | ωexe | ωeye | Be | αe | γe | De | βe | re | Trans. | ν00 |
A 1Σ(+) 10 | 16616.92 | 914.24 Z | 3.38 | 0.377985 | 0.001827 | 2.587E-7 | 1.6E-09 | 1.742454 | A ↔ X 5 R | 16586.96 Z | ||
↳missing citation; Weltner and McLeod, 1965; Edvinsson and Nylen, 1971; Wentink and Spindler, 1972 | ||||||||||||
X 1Σ(+) | 0 | 974.09 Z | 3.228 | 0.386537 | 0.001724 | 2.438E-7 | 6E-10 | 1.723071 | 11 |

References

Rauh and Ackermann, 1974
Rauh, E.G.; Ackermann, R.J.,
First ionization potentials of some refractory oxide vapors,
J. Chem. Phys., 1974, 60, 1396. [all data]
Weltner and McLeod, 1965
Weltner, W., Jr.; McLeod, D., Jr.,
Spectroscopy of titanium, zirconium, and hafnium oxides in neon and argon matrices at 4 and 20°K,
J. Phys. Chem., 1965, 69, 3488. [all data]
Edvinsson and Nylen, 1971
Edvinsson, G.; Nylen, Ch.,
On the band spectrum of HfO,
Phys. Scr., 1971, 3, 261. [all data]
Wentink and Spindler, 1972
Wentink, T., Jr.; Spindler, R.J., Jr.,
The isoelectronic series ScF through ThO-I notes on the band spectra of TiO, HfO and ThO,
J. Quant. Spectrosc. Radiat. Transfer, 1972, 12, 1569. [all data]
Edvinsson, 1966
Edvinsson, G.,
On the bandspectrum of hafnium oxide,
Die Naturwissenschaften, 1966, 53, 177. [all data]
Edvinsson, 1971
Edvinsson,
Dissertation. USIP Report 71-09, Stockholm, 1971, 1. [all data]
Ackermann and Rauh, 1974
Ackermann, R.J.; Rauh, E.G.,
Thermodynamic properties of ZrO (g) and HfO (g); a critical examination of isomolecular oxygen-exchange reactions,
J. Chem. Phys., 1974, 60, 2266. [all data]
Panish and Reif, 1963
Panish, M.B.; Reif, L.,
Thermodynamics of the vaporization of Hf and HfO2: dissociation energy of HfO,
J. Chem. Phys., 1963, 38, 253. [all data]