germanium telluride

Gas phase ion energetics data

Data compiled as indicated in comments:
LL - Sharon G. Lias and Joel F. Liebman
LLK - Sharon G. Lias, Rhoda D. Levin, and Sherif A. Kafafi
RDSH - Henry M. Rosenstock, Keith Draxl, Bruce W. Steiner, and John T. Herron

Ionization energy determinations

IE (eV) Method Reference Comment
9.7EIBalducci, Sacconi, et al., 1991LL
10.1 ± 0.5EIColin and Drowart, 1964RDSH
9.1PEWhite, Rosenberg, et al., 1979Vertical value; LLK

Appearance energy determinations

Ion AE (eV) Other Products MethodReferenceComment
Ge+12.2TeEIBalducci, Sacconi, et al., 1991LL
Ge+12.6 ± 0.5TeEIColin and Drowart, 1964RDSH
Te+13.0GeEIBalducci, Sacconi, et al., 1991LL
Te+13.3 ± 0.5GeEIColin and Drowart, 1964RDSH

References

Balducci, Sacconi, et al., 1991
Balducci, G.; Sacconi, L.V.; Gigli, G., The dimerization energies of the Ge2S2, Ge2Se2, and Ge2Te2 molecules, Ber. Bunsen-Ges. Phys. Chem., 1991, 95, 1651. [all data]

Colin and Drowart, 1964
Colin, R.; Drowart, J., Thermodynamic study of germanium monotelluride using a mass spectrometer, J. Phys. Chem., 1964, 68, 428. [all data]

White, Rosenberg, et al., 1979
White, M.G.; Rosenberg, R.A.; Lee, S.T.; Shirley, D.A., The He(I) photoelectron spectroscopy of heavy group IV-VI diatomics, J. Electron Spectrosc. Relat. Phenom., 1979, 17, 323. [all data]