Benzeneethanamine, 3,4-dimethoxy-
- Formula: C10H15NO2
- Molecular weight: 181.2316
- IUPAC Standard InChIKey: ANOUKFYBOAKOIR-UHFFFAOYSA-N
- CAS Registry Number: 120-20-7
- Chemical structure:
View 3d structure (requires JavaScript / HTML 5) - Species with the same structure:
- Other names: Phenethylamine, 3,4-dimethoxy-; β-(3,4-Dimethoxyphenyl)ethylamine; DIMPEA; DMPE; DMPEA; Homoveratrylamine; 2-(3,4-Dimethoxyphenyl)ethylamine; 3,4-Dimethoxybenzeneethanamine; 3,4-Dimethoxyphenethylamine; Benzenethanamine, 3,4-dimethoxy-; 3,4-Dimethoxyphenylethylamine; Dimethoxydopamine; Dimethoxyphenylethylamine; Dopamine dimethyl ether; 3,4-Dimethoxy-β-phenethylamine; 3,4-Dimethoxy-β-phenylethylamine; 3,4-Dimethoxyphenylethylamine(base); 3,4-Di-O-methyldopamine; O,O-Dimethyldopamine; 3,4-Dimethoxypheneethylamine; Dimethylmescaline; NSC 16948

Phase change data

Data compiled by: Robert L. Brown and Stephen E. Stein
Reduced pressure boiling point
Tboil (K) | Pressure (bar) | Reference |
---|---|---|
461.2 | 0.020 | Aldrich Chemical Company Inc., 1990 |
460. to 461. | 0.020 | Frinton Laboratories Inc., 1986 |

Reaction thermochemistry data

Data compiled by: José A. Martinho Simões
Individual Reactions
C18H27ClRu (solution) + (solution) = C16H31ClP2Ru (solution) +
(solution)
By formula: C18H27ClRu (solution) + C10H15NO2 (solution) = C16H31ClP2Ru (solution) + C8H12 (solution)
Quantity | Value | Units | Method | Reference | Comment |
---|---|---|---|---|---|
ΔrH° | -145.6 ± 0.8 | kJ/mol | RSC | Luo, Zhu, et al., 1994 | solvent: Tetrahydrofuran; The enthalpy of solution of Ru(Cp*)(cod)(Cl)(cr) was measured as 20.5 ± 0.8 kJ/mol Luo, Nolan, et al., 1993. |

Gas phase ion energetics data

Data compiled by: Sharon G. Lias, Rhoda D. Levin, and Sherif A. Kafafi
Ionization energy determinations
IE (eV) | Method | Reference | Comment |
---|---|---|---|
7.4 | PE | Domelsmith, Eaton, et al., 1981 | |
8.03 | PE | Domelsmith, Eaton, et al., 1981 | Vertical value |
8.03 ± 0.16 | PE | Domelsmith, Munchausen, et al., 1977 | Vertical value |

Normal alkane RI, non-polar column, custom temperature program

Column type | Active phase | I | Reference | Comment |
---|---|---|---|---|
Other | Methyl Silicone | 1551. | Ardrey and Moffat, 1981 | Program: not specified |

References

Aldrich Chemical Company Inc., 1990
Aldrich Chemical Company Inc.,
Catalog Handbook of Fine Chemicals, Aldrich Chemical Company, Inc., Milwaukee WI, 1990, 1. [all data]
Frinton Laboratories Inc., 1986
Frinton Laboratories Inc.,
Catalog Number 11, Frinton Laboratories Inc., Vineland, NJ, 1986, 99. [all data]
Luo, Zhu, et al., 1994
Luo, L.; Zhu, N.; Zhu, N.-J.; Stevens, E.D.; Nolan, S.P.; Fagan, P.J.,
Organometallics, 1994, 13, 669. [all data]
Luo, Nolan, et al., 1993
Luo, L.; Nolan, S.P.; Fagan, P.J.,
Organometallics, 1993, 12, 4305. [all data]
Domelsmith, Eaton, et al., 1981
Domelsmith, L.N.; Eaton, T.A.; Houk, K.N.; Anderson, G.M., III; Glennon, R.A.; Shulgin, A.T.; Castagnoli, N., Jr.; Kollman, P.A.,
Photoelectron spectra of psychotropic drugs. 6. Relationships between physical properties and pharmacological actions of amphetamine analogues,
J. Med. Chem., 1981, 24, 1414. [all data]
Domelsmith, Munchausen, et al., 1977
Domelsmith, L.N.; Munchausen, L.L.; Houk, K.N.,
Photoelectron spectra of psychotropic drugs. 1. Phenethylamines, tryptamines, and LSD,
J. Am. Chem. Soc., 1977, 99, 4311. [all data]
Ardrey and Moffat, 1981
Ardrey, R.E.; Moffat, A.C.,
Gas-liquid chromatographic retention indices of 1318 substances of toxicological interest on SE-30 or OV-1 stationary phase,
J. Chromatogr., 1981, 220, 3, 195-252, https://doi.org/10.1016/S0021-9673(00)81925-1
. [all data]