Cesium, compound with sodium (1:1)
- Formula: CsNa
- Molecular weight: 155.8952212
- IUPAC Standard InChIKey: JHXRMVMZFQNEJK-UHFFFAOYSA-N
- CAS Registry Number: 12018-60-9
- Chemical structure:
View 3d structure (requires JavaScript / HTML 5) - Information on this page:

Gas phase ion energetics data

Data compiled by: Sharon G. Lias, John E. Bartmess, Joel F. Liebman, John L. Holmes, Rhoda D. Levin, and W. Gary Mallard
Ionization energy determinations
IE (eV) | Method | Reference |
---|---|---|
4.05 ± 0.04 | PI | Kappes and Schumacher, 1985 |
4.05 ± 0.06 | PI | Kappes, Radi, et al., 1985 |

Constants of diatomic molecules

Data compiled by: Klaus P. Huber and Gerhard H. Herzberg
Data collected through March, 1977
Symbol | Meaning |
---|---|
State | electronic state and / or symmetry symbol |
Te | minimum electronic energy (cm-1) |
ωe | vibrational constant – first term (cm-1) |
ωexe | vibrational constant – second term (cm-1) |
ωeye | vibrational constant – third term (cm-1) |
Be | rotational constant in equilibrium position (cm-1) |
αe | rotational constant – first term (cm-1) |
γe | rotation-vibration interaction constant (cm-1) |
De | centrifugal distortion constant (cm-1) |
βe | rotational constant – first term, centrifugal force (cm-1) |
re | internuclear distance (Å) |
Trans. | observed transition(s) corresponding to electronic state |
ν00 | position of 0-0 band (units noted in table) |
State | Te | ωe | ωexe | ωeye | Be | αe | γe | De | βe | re | Trans. | ν00 |
---|---|---|---|---|---|---|---|---|---|---|---|---|
Fragment of another system overlapping C- X | ||||||||||||
C | (24270) | (62) H | (C ← X) (R) | 24250 H | ||||||||
↳missing citation; Weizel and Kulp, 1930 | ||||||||||||
B | (18250) | (65) H | B ← X R | 18233 H | ||||||||
↳missing citation; Weizel and Kulp, 1930 | ||||||||||||
X 1Σ+ | 0 | (98) H | (4.0) 1 2 |

References

Kappes and Schumacher, 1985
Kappes, M.M.; Schumacher, E.,
Generation, spectroscopic and chemical characterization of metal clusters (Mx, x < 65), a progress report,
Surf. Sci., 1985, 156, 1. [all data]
Kappes, Radi, et al., 1985
Kappes, M.M.; Radi, P.; Schar, M.; Schumacher, E.,
Photoionization measurements on dialkali monohalides generated in supersonic nozzle beams,
Chem. Phys. Lett., 1985, 113, 243. [all data]
Weizel and Kulp, 1930
Weizel, W.; Kulp, M.,
Uber die bandensysteme der alkalidampfe,
Ann. Phys. (Leipzig), 1930, 4, 971. [all data]
Neumann and Pauly, 1968
Neumann, W.; Pauly, H.,
Information on the 1Σ+ and 3Σ+ potentials of NaCs from total scattering cross-section measurements,
Phys. Rev. Lett., 1968, 20, 8, 357-359. [all data]
Schlier and Vietzke, 1969
Schlier, Ch.; Vietzke, E.,
The singlet potential of alkali diatoms,
Chem. Phys. Lett., 1969, 3, 4, 250-252. [all data]
Dagdigian and Wharton, 1972
Dagdigian, P.J.; Wharton, L.,
Molecular beam electric deflection and resonance spectroscopy of the heteronuclear alkali dimers: 39K7Li, Rb7Li, 39K23Na, Rb23Na, and 133Cs23Na,
J. Chem. Phys., 1972, 57, 1487. [all data]