Dichlorine heptoxide
- Formula: Cl2O7
- Molecular weight: 182.902
- IUPAC Standard InChIKey: SCDFUIZLRPEIIH-UHFFFAOYSA-N
- CAS Registry Number: 12015-53-1
- Chemical structure:
View 3d structure (requires JavaScript / HTML 5) - Other names: Chlorine oxide (Cl2O7); Chlorine heptoxide; Perchloric anhydride

Phase change data

Antoine Equation Parameters
log10(P) = A − (B / (T + C))
P = vapor pressure (bar)
T = temperature (K)
View plot Requires a JavaScript / HTML 5 canvas capable browser.
Temperature (K) | A | B | C | Reference | Comment |
---|---|---|---|---|---|
227.9 to 352.0 | 5.314 | 1880.127 | 1.731 | Stull, 1947 | Coefficents calculated by NIST from author's data. |

Gas phase ion energetics data

Data compiled by: Henry M. Rosenstock, Keith Draxl, Bruce W. Steiner, and John T. Herron
Appearance energy determinations
Ion | AE (eV) | Other Products | Method | Reference | Comment |
---|---|---|---|---|---|
ClO3+ | 13.00 ± 0.05 | ? | EI | Fisher, 1968 |

References

Stull, 1947
Stull, Daniel R.,
Vapor Pressure of Pure Substances. Organic and Inorganic Compounds,
Ind. Eng. Chem., 1947, 39, 4, 517-540, https://doi.org/10.1021/ie50448a022
. [all data]
Fisher, 1968
Fisher, I.P.,
Intermediates in the pyrolysis and mass spectrometry of chlorine monoxide and chlorine heptoxide,
J. Chem. Soc. Faraday Trans., 1968, 64, 1852. [all data]