boron carbide
- Formula: CB
- Molecular weight: 22.822
- IUPAC Standard InChIKey: UPGPUHVYNXOPJN-UHFFFAOYSA-N
- CAS Registry Number: 12011-54-0
- Chemical structure:
View 3d structure (requires JavaScript / HTML 5) - Permanent link for this species. Use this link for bookmarking this species for future reference.

Gas phase thermochemistry data

Quantity | Value | Units | Method | Reference | Comment |
---|---|---|---|---|---|
ΔfH°gas | 828.43 | kJ/mol | Review | Chase, 1998 | Data last reviewed in June, 1963 |
Quantity | Value | Units | Method | Reference | Comment |
S°gas,1 bar | 208.56 | J/mol*K | Review | Chase, 1998 | Data last reviewed in June, 1963 |
Gas Phase Heat Capacity (Shomate Equation)
Cp° = A + B*t + C*t2 + D*t3 +
E/t2
H° − H°298.15= A*t + B*t2/2 +
C*t3/3 + D*t4/4 − E/t + F − H
S° = A*ln(t) + B*t + C*t2/2 + D*t3/3 −
E/(2*t2) + G
Cp = heat capacity (J/mol*K)
H° = standard enthalpy (kJ/mol)
S° = standard entropy (J/mol*K)
t = temperature (K) / 1000.
View plot Requires a JavaScript / HTML 5 canvas capable browser.
Temperature (K) | 298. to 1100. | 1100. to 6000. |
---|---|---|
A | 19.19807 | 36.89732 |
B | 35.92064 | 0.624023 |
C | -27.53189 | -0.058068 |
D | 7.805629 | 0.004012 |
E | 0.180789 | -1.929339 |
F | 821.9468 | 812.5788 |
G | 223.2507 | 246.3577 |
H | 828.4320 | 828.4320 |
Reference | Chase, 1998 | Chase, 1998 |
Comment | Data last reviewed in June, 1963 | Data last reviewed in June, 1963 |

Gas phase ion energetics data

Data compiled as indicated in comments:
RDSH - Henry M. Rosenstock, Keith Draxl, Bruce W. Steiner, and John T. Herron
B - John E. Bartmess
Electron affinity determinations
EA (eV) | Reference | Comment |
---|---|---|
>2.40 ± 0.30 | Reid, 1993 | EA probably 64.6 kcal/mol.; B |
Ionization energy determinations
IE (eV) | Method | Reference | Comment |
---|---|---|---|
10.0 ± 0.6 | EI | Verhaegen, Stafford, et al., 1962 | RDSH |
10.5 | EI | Vilesov and Terenin, 1957 | RDSH |

References

Chase, 1998
Chase, M.W., Jr.,
NIST-JANAF Themochemical Tables, Fourth Edition,
J. Phys. Chem. Ref. Data, Monograph 9, 1998, 1-1951. [all data]
Reid, 1993
Reid, C.J.,
Electron Affinities of BH, B2, BC, and BN molecules determined using Charge Inversion Spectrometry,
Int. J. Mass Spectrom. Ion Proc., 1993, 127, 147, https://doi.org/10.1016/0168-1176(93)87087-9
. [all data]
Verhaegen, Stafford, et al., 1962
Verhaegen, G.; Stafford, F.E.; Ackerman, M.; Drowart, J.,
Mass spectrometric investigation of gaseous species in the system boron-carbon,
Nature, 1962, 193, 1280. [all data]
Vilesov and Terenin, 1957
Vilesov, F.I.; Terenin, A.N.,
The photoionization of the vapors of certain organic compounds,
Dokl. Akad. Nauk SSSR, 1957, 115, 744, In original 539. [all data]