Sydnone, 3-phenyl-
- Formula: C8H6N2O2
- Molecular weight: 162.1454
- IUPAC Standard InChIKey: KQEVEDHJIGSXDK-UHFFFAOYSA-N
- CAS Registry Number: 120-06-9
- Chemical structure:
View 3d structure (requires JavaScript / HTML 5) - Other names: N-Phenylsydnone; 3-Phenylsydnone; Phenylsydnone; 3-Phenylsydnon

Gas phase ion energetics data

Data compiled by: Sharon G. Lias, Rhoda D. Levin, and Sherif A. Kafafi
Appearance energy determinations
Ion | AE (eV) | Other Products | Method | Reference | Comment |
---|---|---|---|---|---|
C8H6N2O2+ | 9.0 | ? | CTS | Chinone and Ohta, 1974 |

References

Chinone and Ohta, 1974
Chinone, A.; Ohta, M.,
Charge-transfer complex of sydnones,
Bull. Chem. Soc. Jpn., 1974, 47, 1032. [all data]