Boron difluoride oxide
- Formula: BF2O
- Molecular weight: 64.807
- IUPAC Standard InChIKey: VNLLIILXDHATTO-UHFFFAOYSA-N
- CAS Registry Number: 12006-82-5
- Chemical structure:
View 3d structure (requires JavaScript / HTML 5) - Permanent link for this species. Use this link for bookmarking this species for future reference.

Gas phase ion energetics data

Data compiled by: Sharon G. Lias, Rhoda D. Levin, and Sherif A. Kafafi
Ionization energy determinations
IE (eV) | Method | Reference |
---|---|---|
17. ± 1. | EI | Uy, Srivastava, et al., 1971 |

References

Uy, Srivastava, et al., 1971
Uy, O.M.; Srivastava, R.D.; Farber, M.,
Mass spectrometric determination of the heats of formation of gaseous BO2 BOF2,
High Temp. Sci., 1971, 3, 462. [all data]