Phenol, 4-methoxy-, acetate
- Formula: C9H10O3
- Molecular weight: 166.1739
- IUPAC Standard InChIKey: YAPCNXGBNRDBIW-UHFFFAOYSA-N
- CAS Registry Number: 1200-06-2
- Chemical structure:
View 3d structure (requires JavaScript / HTML 5) - Other names: Phenol, p-methoxy-, acetate; p-Acetoxyanisole; p-Methoxyphenyl acetate; 4-Methoxyphenyl acetate; 4-Methoxyphenol, acetate

Gas phase ion energetics data

Data compiled by: Sharon G. Lias, Rhoda D. Levin, and Sherif A. Kafafi
Ionization energy determinations
IE (eV) | Method | Reference |
---|---|---|
7.9 ± 0.2 | EI | Gamble, Gilbert, et al., 1971 |
Appearance energy determinations
Ion | AE (eV) | Other Products | Method | Reference | Comment |
---|---|---|---|---|---|
C2H3O+ | 14.6 ± 0.2 | C6H4(OCH3) | EI | Gamble, Gilbert, et al., 1971 | |
C7H8O2+ | 9.5 ± 0.2 | CH2=C=O | EI | Gamble, Gilbert, et al., 1971 |

Van Den Dool and Kratz RI, non-polar column, custom temperature program

Column type | Active phase | I | Reference | Comment |
---|---|---|---|---|
Capillary | VF-5MS | 1324. | Tret'yakov, 2008 | 30. m/0.25 mm/0.25 μm, He; Program: Multi-step temperature program; T(initial)=60C; T(final)=270C |

References

Gamble, Gilbert, et al., 1971
Gamble, A.A.; Gilbert, J.R.; Tillett, J.G.,
Substituent effects on the mass spectra of substituted phenyl acetates,
Org. Mass Spectrom., 1971, 5, 1093. [all data]
Tret'yakov, 2008
Tret'yakov, K.V.,
Retention Data. NIST Mass Spectrometry Data Center., NIST Mass Spectrometry Data Center, 2008. [all data]