Benzene, (4-bromobutoxy)-
- Formula: C10H13BrO
- Molecular weight: 229.114
- IUPAC Standard InChIKey: QBLISOIWPZSVIK-UHFFFAOYSA-N
- CAS Registry Number: 1200-03-9
- Chemical structure:
View 3d structure (requires JavaScript / HTML 5) - Other names: (4-Bromobutoxy)benzene; 4-Bromobutyl phenyl ether; 1-Bromo-4-phenoxybutane; Ether, 4-bromobutyl phenyl; Phenoxybutyl bromide; 4-Phenoxybutyl bromide

Phase change data

Data compiled by: Robert L. Brown and Stephen E. Stein
Reduced pressure boiling point
Tboil (K) | Pressure (bar) | Reference |
---|---|---|
427.7 | 0.024 | Weast and Grasselli, 1989 |

Gas phase ion energetics data

Data compiled by: Sharon G. Lias, Rhoda D. Levin, and Sherif A. Kafafi
Ionization energy determinations
IE (eV) | Method | Reference |
---|---|---|
8.54 ± 0.05 | EI | Schwarz, Petersen, et al., 1977 |

References

Weast and Grasselli, 1989
CRC Handbook of Data on Organic Compounds, 2nd Editon, Weast,R.C and Grasselli, J.G., ed(s)., CRC Press, Inc., Boca Raton, FL, 1989, 1. [all data]
Schwarz, Petersen, et al., 1977
Schwarz, H.; Petersen, R.D.; Van De Sande, C.C.,
Entropische und energetische Effekte bei der Bildung cyclischer Oxonium-, Sulfonium- und Bromonium-Ionen aus ωsubstituierten Phenoxyalkanen,
Org. Mass Spectrom., 1977, 12, 391. [all data]