Benzonitrile, 4-(dimethylamino)-
- Formula: C9H10N2
- Molecular weight: 146.1891
- IUPAC Standard InChIKey: JYMNQRQQBJIMCV-UHFFFAOYSA-N
- CAS Registry Number: 1197-19-9
- Chemical structure:
View 3d structure (requires JavaScript / HTML 5) - Other names: Benzonitrile, p-(dimethylamino)-; p-(Dimethylamino)benzoic acid nitrile; p-(Dimethylamino)benzonitrile; p-(N,N-Dimethylamino)benzonitrile; p-Cyano-N,N-dimethylaniline; N,N-Dimethyl-p-cyanoaniline; N,N-Dimethyl-4-cyanoaniline; para(Dimethylamino)benzonitrile; 4-(Dimethylamino)benzenecarbonitrile; 4-(Dimethylamino)benzonitrile; 4-Cyano-N,N-dimethylaniline; 1-(Dimethylamino)-4-cyanobenzene; NSC 409122

Phase change data

Data compiled by: Robert L. Brown and Stephen E. Stein
Quantity | Value | Units | Method | Reference | Comment |
---|---|---|---|---|---|
Tboil | 591.2 | K | N/A | Weast and Grasselli, 1989 | |
Tboil | 591. | K | N/A | Buckingham and Donaghy, 1982 | |
Quantity | Value | Units | Method | Reference | Comment |
Tfus | 349. | K | N/A | Buckingham and Donaghy, 1982 |

Gas phase ion energetics data

Data evaluated as indicated in comments:
HL - Edward P. Hunter and Sharon G. Lias
Data compiled as indicated in comments:
LLK - Sharon G. Lias, Rhoda D. Levin, and Sherif A. Kafafi
RDSH - Henry M. Rosenstock, Keith Draxl, Bruce W. Steiner, and John T. Herron
Quantity | Value | Units | Method | Reference | Comment |
---|---|---|---|---|---|
Proton affinity (review) | 889.1 | kJ/mol | N/A | Hunter and Lias, 1998 | HL |
Quantity | Value | Units | Method | Reference | Comment |
Gas basicity | 862.6 | kJ/mol | N/A | Hunter and Lias, 1998 | HL |
Ionization energy determinations
IE (eV) | Method | Reference | Comment |
---|---|---|---|
7.60 | PE | Modelli and Distefano, 1981 | LLK |
7.99 ± 0.04 | EI | Buchs, 1970 | RDSH |
7.91 | PE | Modelli and Distefano, 1981 | Vertical value; LLK |

References

Weast and Grasselli, 1989
CRC Handbook of Data on Organic Compounds, 2nd Editon, Weast,R.C and Grasselli, J.G., ed(s)., CRC Press, Inc., Boca Raton, FL, 1989, 1. [all data]
Buckingham and Donaghy, 1982
Buckingham, J.; Donaghy, S.M.,
Dictionary of Organic Compounds: Fifth Edition, Chapman and Hall, New York, 1982, 1. [all data]
Hunter and Lias, 1998
Hunter, E.P.; Lias, S.G.,
Evaluated Gas Phase Basicities and Proton Affinities of Molecules: An Update,
J. Phys. Chem. Ref. Data, 1998, 27, 3, 413-656, https://doi.org/10.1063/1.556018
. [all data]
Modelli and Distefano, 1981
Modelli, A.; Distefano, G.,
L. C. B. O.: An easy method to predict valence ionization energies. Application to substituted benzenes,
Z. Naturforsch. A:, 1981, 36, 1344. [all data]
Buchs, 1970
Buchs, A.,
Etude par spectrometrie de masse de l'ionisation de benzonitriles, de phenylacetonitriles et de N,N-dimethylanilines substitues,
Helv. Chim. Acta, 1970, 53, 2026. [all data]