Benzophenone
- Formula: C13H10O
- Molecular weight: 182.2179
- IUPAC Standard InChIKey: RWCCWEUUXYIKHB-UHFFFAOYSA-N
- CAS Registry Number: 119-61-9
- Chemical structure:
View 3d structure (requires JavaScript / HTML 5) - Other names: Methanone, diphenyl-; α-Oxodiphenylmethane; α-Oxoditane; Benzene, benzoyl-; Benzoylbenzene; Diphenyl ketone; Diphenylmethanone; Phenyl ketone; Ketone, diphenyl; alpha-Oxodiphenylmethane; alpha-Oxoditane; Adjutan 6016; Kayacure BP; Diphenyl-methanon; NSC 8077; 1-Benzophenone; Cinnarizine M (benzophenone); Cyclizine M (Benzophenone)

Gas phase thermochemistry data

Data compiled by: Hussein Y. Afeefy, Joel F. Liebman, and Stephen E. Stein
Quantity | Value | Units | Method | Reference | Comment |
---|---|---|---|---|---|
ΔfH°gas | 11.93 ± 0.71 | kcal/mol | Cm | Sabbah and Laffitte, 1978 |

Condensed phase thermochemistry data

Data compiled as indicated in comments:
ALS - Hussein Y. Afeefy, Joel F. Liebman, and Stephen E. Stein
DH - Eugene S. Domalski and Elizabeth D. Hearing
Quantity | Value | Units | Method | Reference | Comment |
---|---|---|---|---|---|
ΔfH°solid | -8.2 | kcal/mol | Ccb | Colomina, Cambeiro, et al., 1959 | ALS |
ΔfH°solid | -7.9 | kcal/mol | Ccb | Springall and White, 1954 | ALS |
ΔfH°solid | -7.73 ± 0.78 | kcal/mol | Ccb | Parks, Mosley, et al., 1950 | Reanalyzed by Cox and Pilcher, 1970, Original value = -7.86 ± 0.004 kcal/mol; ALS |
ΔfH°solid | -12.15 | kcal/mol | Ccb | Landrieu and Blatt, 1924 | ALS |
Quantity | Value | Units | Method | Reference | Comment |
ΔcH°solid | -1555. ± 2. | kcal/mol | AVG | N/A | Average of 6 values; Individual data points |
Constant pressure heat capacity of solid
Cp,solid (cal/mol*K) | Temperature (K) | Reference | Comment |
---|---|---|---|
53.728 | 300. | DeKruif, Van Miltenburg, et al., 1983 | T = 80 to 345 K.; DH |

Phase change data

Data compiled as indicated in comments:
BS - Robert L. Brown and Stephen E. Stein
TRC - Thermodynamics Research Center, NIST Boulder Laboratories, Chris Muzny director
ALS - Hussein Y. Afeefy, Joel F. Liebman, and Stephen E. Stein
AC - William E. Acree, Jr., James S. Chickos
DH - Eugene S. Domalski and Elizabeth D. Hearing
Quantity | Value | Units | Method | Reference | Comment |
---|---|---|---|---|---|
Tboil | 550. ± 100. | K | AVG | N/A | Average of 7 values; Individual data points |
Quantity | Value | Units | Method | Reference | Comment |
Tfus | 321.2 ± 0.7 | K | AVG | N/A | Average of 23 out of 24 values; Individual data points |
Quantity | Value | Units | Method | Reference | Comment |
Ttriple | 321.03 | K | N/A | De Kruif, van Miltenburg, et al., 1983 | Uncertainty assigned by TRC = 0.02 K; TRC |
Quantity | Value | Units | Method | Reference | Comment |
Tc | 830. | K | N/A | Steele, Chirico, et al., 1994 | Uncertainty assigned by TRC = 2. K; TRC |
Quantity | Value | Units | Method | Reference | Comment |
Pc | 33.08 | atm | N/A | Steele, Chirico, et al., 1994 | Uncertainty assigned by TRC = 0.04 atm; TRC |
Quantity | Value | Units | Method | Reference | Comment |
ρc | 1.762 | mol/l | N/A | Steele, Chirico, et al., 1994 | Uncertainty assigned by TRC = 0.02 mol/l; TRC |
Quantity | Value | Units | Method | Reference | Comment |
ΔvapH° | 22.700 | kcal/mol | V | Neumann and Volker, 1932 | ALS |
Quantity | Value | Units | Method | Reference | Comment |
ΔsubH° | 21. ± 3. | kcal/mol | AVG | N/A | Average of 11 values; Individual data points |
Reduced pressure boiling point
Tboil (K) | Pressure (atm) | Reference | Comment |
---|---|---|---|
497. to 497. | 0.132 | Buckingham and Donaghy, 1982 | BS |
430.7 | 0.013 | Buckingham and Donaghy, 1982 | BS |
Enthalpy of vaporization
ΔvapH (kcal/mol) | Temperature (K) | Method | Reference | Comment |
---|---|---|---|---|
14.1 | 545. | N/A | Jaquerod and Wassmer, 2006 | Based on data from 530. to 575. K. See also Boublik, Fried, et al., 1984.; AC |
15.6 | 448. | A | Stephenson and Malanowski, 1987 | Based on data from 433. to 673. K.; AC |
14.9 | 488. | N/A | Dreisbach and Shrader, 1949 | Based on data from 473. to 579. K. See also Dreisbach and Martin, 1949 and Boublik, Fried, et al., 1984.; AC |
Antoine Equation Parameters
log10(P) = A − (B / (T + C))
P = vapor pressure (atm)
T = temperature (K)
View plot Requires a JavaScript / HTML 5 canvas capable browser.
Temperature (K) | A | B | C | Reference | Comment |
---|---|---|---|---|---|
473.7 to 579.3 | 4.35667 | 2116.372 | -93.43 | Dreisbach and Shrader, 1949 | Coefficents calculated by NIST from author's data. |
Enthalpy of sublimation
ΔsubH (kcal/mol) | Temperature (K) | Method | Reference | Comment |
---|---|---|---|---|
22.2 ± 0.2 | 306. | ME | Ginkel, Kruif, et al., 2001 | Based on data from 294. to 318. K.; AC |
21.50 | 308. | ME | Stephenson and Malanowski, 1987 | Based on data from 298. to 318. K. See also Pribilová and Pouchlý, 1974.; AC |
22.6 ± 0.2 | 321. | DM | Kruif, Miltenburg, et al., 1983 | AC |
22.7 ± 0.05 | 304. | ME | Colomina, Jimenez, et al., 1980 | Based on data from 295. to 313. K.; AC |
22.4 ± 0.1 | 307. | TE,ME | De Kruif and Van Ginkel, 1977 | Based on data from 297. to 317. K.; AC |
22.7 ± 0.36 | 305. | TE | DeKruif, van Ginkel, et al., 1975 | Based on data from 293. to 318. K.; AC |
23.0 | 306. | N/A | Serpinskii, Voitkevich, et al., 1956 | Based on data from 293. to 319. K.; AC |
18.7 ± 0.29 | 303. | N/A | Wolf and Weghofer, 1938 | Based on data from 290. to 315. K. See also Wolf and Trieschmann, 1934.; AC |
18.7 ± 0.2 | 313. | V | Wolf and Weghofer, 1938, 2 | ALS |
Enthalpy of fusion
ΔfusH (kcal/mol) | Temperature (K) | Method | Reference | Comment |
---|---|---|---|---|
4.3485 | 321.03 | N/A | DeKruif, Van Miltenburg, et al., 1983 | DH |
4.496 | 321.2 | AC | Chirico, Knipmeyer, et al., 2002 | Based on data from 5. to 440. K.; AC |
4.414 | 321.3 | AC | Hanaya, Hikima, et al., 2002 | AC |
4.348 | 324.2 | N/A | Domalski and Hearing, 1996 | AC |
4.2230 | 321.2 | N/A | Eykman, 1889 | DH |
Entropy of fusion
ΔfusS (cal/mol*K) | Temperature (K) | Reference | Comment |
---|---|---|---|
13.54 | 321.03 | DeKruif, Van Miltenburg, et al., 1983 | DH |
13.1 | 321.2 | Eykman, 1889 | DH |

Reaction thermochemistry data

Data compiled by: José A. Martinho Simões
Individual Reactions
C13H10NaO (solution) + 0.5 (solution) = C4CoNaO4 (solution) +
(solution)
By formula: C13H10NaO (solution) + 0.5C8Co2O8 (solution) = C4CoNaO4 (solution) + C13H10O (solution)
Quantity | Value | Units | Method | Reference | Comment |
---|---|---|---|---|---|
ΔrH° | -37.4 ± 2.6 | kcal/mol | RSC | Kiss, Nolan, et al., 1994 | solvent: Tetrahydrofuran |
(solution) +
(cr) = C13H10NaO (solution)
By formula: C13H10O (solution) + Na (cr) = C13H10NaO (solution)
Quantity | Value | Units | Method | Reference | Comment |
---|---|---|---|---|---|
ΔrH° | -38.50 ± 0.60 | kcal/mol | RSC | Kiss, Nolan, et al., 1994 | solvent: Tetrahydrofuran |

Gas phase ion energetics data

Data evaluated as indicated in comments:
HL - Edward P. Hunter and Sharon G. Lias
L - Sharon G. Lias
Data compiled as indicated in comments:
LLK - Sharon G. Lias, Rhoda D. Levin, and Sherif A. Kafafi
RDSH - Henry M. Rosenstock, Keith Draxl, Bruce W. Steiner, and John T. Herron
B - John E. Bartmess
Quantity | Value | Units | Method | Reference | Comment |
---|---|---|---|---|---|
IE (evaluated) | 9.08 ± 0.04 | eV | N/A | N/A | L |
Quantity | Value | Units | Method | Reference | Comment |
Proton affinity (review) | 210.9 | kcal/mol | N/A | Hunter and Lias, 1998 | HL |
Quantity | Value | Units | Method | Reference | Comment |
Gas basicity | 203.8 | kcal/mol | N/A | Hunter and Lias, 1998 | HL |
Electron affinity determinations
EA (eV) | Method | Reference | Comment |
---|---|---|---|
0.62 ± 0.10 | IMRE | Grimsrud, Caldwell, et al., 1985 | ΔGea(423 K) = -15.3 kcal/mol; ΔSea (estimated) = +2.0 eu; B |
1.110 ± 0.040 | LPES | Maeyama, Yagi, et al., 2008 | Stated EA is Vertical Detachment Energy. Threshold adiabatic EA appears to be ca. 0.6 eV - JEB; B |
0.655 ± 0.087 | IMRE | Huh, Kang, et al., 1999 | ΔG(EA) 343K; anchored to ΔG value. Including anchor ΔS, EA is ca. 0.4 kcal/mol more bound.; B |
0.694 ± 0.048 | IMRE | Fukuda and McIver, 1985 | ΔGea(355 K) = -16.7 kcal/mol; ΔSea = 2.0, est. from data in Kebarle and Chowdhury, 1987; B |
0.642 ± 0.052 | ECD | Chen and Wentworth, 1983 | B |
Ionization energy determinations
IE (eV) | Method | Reference | Comment |
---|---|---|---|
9.4 ± 0.1 | EI | Grutzmacher and Schubert, 1979 | LLK |
9.28 | EI | Elder, Beynon, et al., 1976 | LLK |
9.5 ± 0.1 | EI | Krenmayr, Heller, et al., 1974 | LLK |
9.5 ± 0.1 | EI | Heller, Varmuza, et al., 1974 | LLK |
9.46 | EI | Benoit, 1973 | LLK |
9.14 ± 0.03 | PI | Iskakov and Potapov, 1971 | LLK |
9.46 ± 0.05 | EI | Natalis and Franklin, 1965 | RDSH |
9.35 ± 0.04 | EI | Foffani, Pignataro, et al., 1964 | RDSH |
9.4 | PI | Terenin, 1961 | RDSH |
9.05 ± 0.05 | PE | McAlduff and Bunbury, 1979 | Vertical value; LLK |
9.05 | PE | Centineo, Fragala, et al., 1978 | Vertical value; LLK |
Appearance energy determinations
Ion | AE (eV) | Other Products | Method | Reference | Comment |
---|---|---|---|---|---|
C6H5+ | 15.67 | C6H5+CO | EI | Benoit, 1973 | LLK |
C6H5+ | 16.22 ± 0.07 | ? | EI | Natalis and Franklin, 1965 | RDSH |
C7H5O+ | 12.0 ± 0.1 | C6H5 | EI | Grutzmacher and Schubert, 1979 | LLK |
C7H5O+ | 11.45 | C6H5 | EI | Elder, Beynon, et al., 1976 | LLK |
C7H5O+ | 11.4 ± 0.1 | C6H5 | EI | Heller, Varmuza, et al., 1974 | LLK |
C7H5O+ | 11.72 | C6H5 | EI | Benoit, 1973 | LLK |
C7H5O+ | 12.00 ± 0.05 | C6H5 | EI | Natalis and Franklin, 1965 | RDSH |
C12H8+ | 17.48 ± 0.12 | ? | EI | Natalis and Franklin, 1965 | RDSH |
C12H9+ | 15.28 ± 0.05 | CO+H? | EI | Natalis and Franklin, 1965 | RDSH |
C12H10+ | 12.24 ± 0.13 | CO | EI | Natalis and Franklin, 1965 | RDSH |

Kovats' RI, non-polar column, isothermal

Column type | Active phase | Temperature (C) | I | Reference | Comment |
---|---|---|---|---|---|
Capillary | SE-30 | 100. | 1606.4 | Tudor, 1997 | 40. m/0.35 mm/0.35 μm |

Kovats' RI, non-polar column, temperature ramp

Column type | Active phase | I | Reference | Comment |
---|---|---|---|---|
Capillary | HP-5MS | 1625. | Asuming, Beauchamp, et al., 2005 | 30. m/0.25 mm/0.25 μm, He, 50. C @ 10. min, 3. K/min, 250. C @ 5. min |

Kovats' RI, non-polar column, custom temperature program

Column type | Active phase | I | Reference | Comment |
---|---|---|---|---|
Capillary | HP-5MS | 1664. | Alissandrakis E., Tarantilis P.A., et al., 2007 | 30. m/0.25 mm/0.25 μm, He; Program: 40C(3min) => 3C/min => 160C => 10C/min => 200C |
Packed | SE-30 | 1611. | Ramsey, Lee, et al., 1980 | He, Chromosorb G HP (80-100 mesh); Column length: 1.5 m; Program: not specified |

Kovats' RI, polar column, isothermal

Column type | Active phase | Temperature (C) | I | Reference | Comment |
---|---|---|---|---|---|
Capillary | Carbowax 20M | 180. | 2443. | Tudor, Moldovan, et al., 1999 | Phase thickness: 0.08 μm |

Van Den Dool and Kratz RI, non-polar column, temperature ramp

Column type | Active phase | I | Reference | Comment |
---|---|---|---|---|
Capillary | HP-5 | 1621. | Quijano, Salamanca, et al., 2007 | 30. m/0.25 mm/0.25 μm, He, 50. C @ 4. min, 4. K/min, 250. C @ 10. min |
Capillary | HP-5MS | 1621. | Pino, Mesa, et al., 2005 | 30. m/0.25 mm/0.25 μm, He, 60. C @ 2. min, 4. K/min, 250. C @ 20. min |
Capillary | SE-54 | 1644. | Kostiainen, 2000 | 25. m/0.32 mm/0.25 μm, He, 40. C @ 1. min, 10. K/min, 280. C @ 10. min |
Capillary | SE-54 | 1610.4 | Shapi and Hesso, 1990 | 25. m/0.32 mm/0.15 μm, He, 40. C @ 1. min, 5. K/min, 280. C @ 15. min |

Van Den Dool and Kratz RI, non-polar column, custom temperature program

Column type | Active phase | I | Reference | Comment |
---|---|---|---|---|
Capillary | 5 % Phenyl methyl siloxane | 1621. | Yasuhara, Shiraishi, et al., 1997 | 25. m/0.31 mm/0.52 μm, He; Program: 50C(2min) => (20C/min) => 120C => (7C/min) => 310C(10min) |
Packed | SE-30 | 1611. | Peng, Ding, et al., 1988 | Supelcoport; Chromosorb; Column length: 3.05 m; Program: 40C(5min) => 10C/min => 200C or 250C (60min) |

Van Den Dool and Kratz RI, polar column, temperature ramp

Column type | Active phase | I | Reference | Comment |
---|---|---|---|---|
Capillary | ZB-Wax | 2427. | Ledauphin, Saint-Clair, et al., 2004 | 30. m/0.25 mm/0.15 μm, He, 35. C @ 5. min, 5. K/min, 220. C @ 10. min |
Capillary | HP-Innowax | 2505. | Adamiec, Rossner, et al., 2001 | 30. m/0.25 mm/0.25 μm, N2, 5. K/min; Tstart: 60. C; Tend: 220. C |

Normal alkane RI, non-polar column, temperature ramp

Column type | Active phase | I | Reference | Comment |
---|---|---|---|---|
Capillary | HP-5 MS | 1623. | Kotowska, Zalikowski, et al., 2012 | 30. m/0.25 mm/0.25 μm, Helium, 35. C @ 5. min, 3. K/min, 300. C @ 15. min |
Capillary | VF-5 MS | 1636. | Leffingwell and Alford, 2011 | 60. m/0.32 mm/0.25 μm, Helium, 2. K/min, 260. C @ 28. min; Tstart: 30. C |
Capillary | VF-5 MS | 1637. | Leffingwell and Alford, 2011 | 60. m/0.32 mm/0.25 μm, Helium, 2. K/min, 260. C @ 28. min; Tstart: 30. C |
Capillary | HP-5 MS | 1635. | Lazarevic, Radulovic, et al., 2010 | 30. m/0.25 mm/0.25 μm, Helium, 5. K/min; Tstart: 70. C; Tend: 290. C |
Capillary | HP-5 MS | 1634. | Radulovic, Blagojevic, et al., 2010 | 30. m/0.25 mm/0.25 μm, Helium, 5. K/min, 290. C @ 10. min; Tstart: 70. C |
Capillary | HP-5 MS | 1631. | Radulovic, Dordevic, et al., 2010 | 30. m/0.25 mm/0.25 μm, Helium, 5. K/min, 290. C @ 10. min; Tstart: 70. C |
Capillary | DB-5 | 1644. | Grung, Lichtenthaler, et al., 2007 | 30. m/0.25 mm/0.25 μm, 5. K/min, 280. C @ 10. min; Tstart: 40. C |
Capillary | SPB-5 | 1660. | Vasta, Ratel, et al., 2007 | 60. m/0.32 mm/1. μm, 40. C @ 5. min, 3. K/min, 230. C @ 5. min |
Capillary | DB-5 | 1585. | Ozel, Gogus, et al., 2006 | 30. m/0.32 mm/0.25 μm, He, 60. C @ 0.5 min, 5. K/min, 280. C @ 2. min |
Capillary | HP-1 | 1592. | Valette, Fernandez, et al., 2006 | 50. m/0.2 mm/0.5 μm, He, 2. K/min, 250. C @ 40. min; Tstart: 60. C |
Capillary | BPX-5 | 1655. | Dickschat, Martens, et al., 2005 | 25. m/0.22 mm/0.25 μm, He, 50. C @ 5. min, 5. K/min; Tend: 320. C |
Capillary | HP-5 | 1635.1 | Leffingwell and Alford, 2005 | 60. m/0.32 mm/0.25 μm, He, 30. C @ 2. min, 2. K/min, 260. C @ 28. min |
Capillary | CP Sil 5 CB | 1628. | Rohloff and Bones, 2005 | 30. m/0.25 mm/0.25 μm, He, 40. C @ 1. min, 4. K/min; Tend: 220. C |
Capillary | DB-1 | 1573. | Park, Lee, et al., 2004 | 60. m/0.32 mm/0.25 μm, He, 35. C @ 4. min, 2. K/min, 230. C @ 25. min |
Capillary | DB-1 | 1576. | Park, Lee, et al., 2004 | 60. m/0.32 mm/0.25 μm, He, 35. C @ 4. min, 2. K/min, 230. C @ 25. min |
Capillary | DB-1 | 1577. | Park, Lee, et al., 2004 | 60. m/0.32 mm/0.25 μm, He, 35. C @ 4. min, 2. K/min, 230. C @ 25. min |
Capillary | HP-1 | 1612. | Boatright and Crum, 1997 | 30. m/0.25 mm/0.1 μm, He, 50. C @ 2. min, 5. K/min, 300. C @ 3. min |
Capillary | HP-1 | 1612. | Boatright and Crum, 1997 | 30. m/0.25 mm/0.1 μm, He, 50. C @ 2. min, 5. K/min, 300. C @ 3. min |
Capillary | Ultra-1 | 1572. | Okumura, 1991 | 25. m/0.32 mm/0.25 μm, He, 3. K/min; Tstart: 80. C; Tend: 260. C |
Capillary | HP-1 | 1610. | Maurer and Pfleger, 1988 | 12. m/0.20 mm/0.33 μm, He, 100. C @ 3. min, 30. K/min, 310. C @ 5. min |
Capillary | HP-1 | 1610. | Maurer and Pfleger, 1988 | 12. m/0.20 mm/0.33 μm, He, 100. C @ 3. min, 30. K/min, 310. C @ 5. min |

Normal alkane RI, non-polar column, custom temperature program

Column type | Active phase | I | Reference | Comment |
---|---|---|---|---|
Capillary | HP-5 MS | 1640. | Kotowska, Zalikowski, et al., 2012 | 30. m/0.25 mm/0.25 μm, Helium; Program: not specified |
Capillary | SLB-5 MS | 1627. | Mondello, 2012 | 30. m/0.25 mm/0.25 μm, Helium; Program: not specified |
Capillary | SLB-5 MS | 1645. | Mondello, 2012 | 30. m/0.25 mm/0.25 μm, Helium; Program: not specified |
Capillary | VF-5 | 1628. | Shivashankar, Roy, et al., 2012 | 30. m/0.25 mm/0.25 μm, Helium; Program: 50 0C (2 min) 3 0C/min -> 200 0C (3 min) 10 0C/min -> 220 0C (8 min) |
Capillary | VF-5 | 1612. | Shivashankar, Roy, et al., 2012 | 30. m/0.25 mm/0.25 μm, Helium; Program: not specified |
Capillary | HP-5 | 1635. | Zhao, Li, et al., 2008 | 30. m/0.25 mm/0.25 μm; Program: 40 0C (2 min) 5 0C/min -> 80 0C 7 oC/min -> 160 0C 9 0C/min -> 200 0C 20 0C/min -> 280 0C (10 min) |
Capillary | HP-5 | 1644. | Zhao, Li, et al., 2008 | 30. m/0.25 mm/0.25 μm; Program: not specified |
Capillary | SE-30 | 1604. | Vinogradov, 2004 | Program: not specified |
Capillary | BPX-5 | 1655. | Machiels, van Ruth, et al., 2003 | 60. m/0.32 mm/1. μm, He; Program: 40C (4min) => 2C/min => 90C => 4C/min => 130C => 8C/min => 250 C (10min) |
Capillary | HP-1 | 1590. | Teai, Claude-Lafontaine, et al., 2001 | 50. m/0.32 mm/0.52 μm, N2; Program: 40C => 2C/min => 130C => 4C/min => 250C |
Capillary | Methyl Silicone | 1594. | Oda, Yasuhara, et al., 1998 | 25. m/0.25 mm/0.25 μm, He; Program: 50 0C (2 min) 20 0C/min -> 160 0C 5 0C/min -> 210 0C 10 0C/min -> 300 0C |
Capillary | Polydimethyl siloxanes | 1603. | Zenkevich and Chupalov, 1996 | Program: not specified |
Capillary | Methyl Silicone | 1603. | Zenkevich, 1994 | Program: not specified |
Capillary | OV-1, SE-30, Methyl silicone, SP-2100, OV-101, DB-1, etc. | 1610. | Waggott and Davies, 1984 | Hydrogen; Column length: 50. m; Column diameter: 0.32 mm; Program: not specified |
Other | Methyl Silicone | 1610. | Ardrey and Moffat, 1981 | Program: not specified |

Normal alkane RI, polar column, temperature ramp

Column type | Active phase | I | Reference | Comment |
---|---|---|---|---|
Capillary | HP-Innowax | 2462. | Soria, Sanz, et al., 2008 | 50. m/0.20 mm/0.20 μm, Helium, 45. C @ 2. min, 4. K/min, 190. C @ 50. min |
Capillary | DB-Wax | 2470. | López, Ezpeleta, et al., 2004 | 60. m/0.25 mm/0.25 μm, He, 40. C @ 5. min, 3. K/min; Tend: 220. C |

Normal alkane RI, polar column, custom temperature program

Column type | Active phase | I | Reference | Comment |
---|---|---|---|---|
Capillary | Carbowax 20M | 2410. | Vinogradov, 2004 | Program: not specified |
Capillary | DB-Wax | 2457. | Peng, Yang, et al., 1991 | Program: not specified |

References

Sabbah and Laffitte, 1978
Sabbah, R.; Laffitte, M.,
Etude thermodynamique de la molecule de benzophenone,
Thermochim. Acta, 1978, 23, 196-198. [all data]
Colomina, Cambeiro, et al., 1959
Colomina, M.; Cambeiro, M.; Perez-Ossorio, R.; Latorre, C.,
Estudios acerca de calores de combustion II. Calores de combustion de benzofenona y sus p-alquilderivados,
Ber. Bunsenges. Phys. Chem., 1959, 509-514. [all data]
Springall and White, 1954
Springall, H.D.; White, T.R.,
Heats of combustion and molecular structure. Part II. The mean bond energy term for the carbonyl system in certain ketones,
J. Chem. Soc., 1954, 2765-27. [all data]
Parks, Mosley, et al., 1950
Parks, G.S.; Mosley, J.R.; Peterson, P.V., Jr.,
Heats of combustion and formation of some organic compounds containing oxygen,
J. Chem. Phys., 1950, 18, 152. [all data]
Cox and Pilcher, 1970
Cox, J.D.; Pilcher, G.,
Thermochemistry of Organic and Organometallic Compounds, Academic Press, New York, 1970, 1-636. [all data]
Landrieu and Blatt, 1924
Landrieu, P.; Blatt, H.,
Thermochemical study of diphenylphenylethinylcarbinol and its derivatives,
Bull. Soc. Chim. Fr., 1924, 35, 1424-1236. [all data]
DeKruif, Van Miltenburg, et al., 1983
DeKruif, C.G.; Van Miltenburg, J.C.; Blok, J.G.,
Molar heat capacities and vapour pressures of solid and liquid benzophenone,
J. Chem. Thermodynam., 1983, 15, 129-136. [all data]
De Kruif, van Miltenburg, et al., 1983
De Kruif, C.G.; van Miltenburg, J.C.; Blok, J.G.,
Molar heat capacities and vapour pressures of solid and liquid benzophenone,
J. Chem. Thermodyn., 1983, 15, 129. [all data]
Steele, Chirico, et al., 1994
Steele, W.V.; Chirico, R.D.; Hossenlopp, I.A.; Knipmeyer, S.E.; Nguyen, A.; Smith, N.K.,
DIPPR project 871. Determination of ideal-gas enthalpies of formation for key compounds. The 1990 project results,
Experimental Results for DIPPR 1990-91 Projects on Phase Equilibria and Pure Component Properties, 1994, 1994, DIPPR Data Ser. No. 2, p. 188-215. [all data]
Neumann and Volker, 1932
Neumann, K.; Volker, E.,
Eine drehwaagemethode zur messung kleinster dampfdruck,
Z. Phys. Chem., 1932, 161, 33-45. [all data]
Buckingham and Donaghy, 1982
Buckingham, J.; Donaghy, S.M.,
Dictionary of Organic Compounds: Fifth Edition, Chapman and Hall, New York, 1982, 1. [all data]
Jaquerod and Wassmer, 2006
Jaquerod, Adrien; Wassmer, Eugene,
Ueber den Siedepunkt des Naphtalins, des Diphenyls und des Benzophenons unter verschiedenem Druck und dessen Bestimmung mit Hilfe des Wasserstoffthermometers,
Ber. Dtsch. Chem. Ges., 2006, 37, 3, 2531-2534, https://doi.org/10.1002/cber.19040370303
. [all data]
Boublik, Fried, et al., 1984
Boublik, T.; Fried, V.; Hala, E.,
The Vapour Pressures of Pure Substances: Selected Values of the Temperature Dependence of the Vapour Pressures of Some Pure Substances in the Normal and Low Pressure Region, 2nd ed., Elsevier, New York, 1984, 972. [all data]
Stephenson and Malanowski, 1987
Stephenson, Richard M.; Malanowski, Stanislaw,
Handbook of the Thermodynamics of Organic Compounds, 1987, https://doi.org/10.1007/978-94-009-3173-2
. [all data]
Dreisbach and Shrader, 1949
Dreisbach, R.R.; Shrader, S.A.,
Vapor Pressure--Temperature Data on Some Organic Compounds,
Ind. Eng. Chem., 1949, 41, 12, 2879-2880, https://doi.org/10.1021/ie50480a054
. [all data]
Dreisbach and Martin, 1949
Dreisbach, R.R.; Martin, R.A.,
Physical Data on Some Organic Compounds,
Ind. Eng. Chem., 1949, 41, 12, 2875-2878, https://doi.org/10.1021/ie50480a053
. [all data]
Ginkel, Kruif, et al., 2001
Ginkel, C.H.D. van; Kruif, C.G. de; Waal, F.E.B. de,
The need for temperature control in effusion experiments (and application to heat of sublimation determination),
J. Phys. E: Sci. Instrum., 2001, 8, 6, 490-492, https://doi.org/10.1088/0022-3735/8/6/018
. [all data]
Pribilová and Pouchlý, 1974
Pribilová, J.; Pouchlý, J.,
Vapour pressure of some low-volatile hydrocarbons determined by the effusion method,
Collect. Czech. Chem. Commun., 1974, 39, 5, 1118-1124, https://doi.org/10.1135/cccc19741118
. [all data]
Kruif, Miltenburg, et al., 1983
Kruif, C.G. de; Miltenburg, J.C. van; Blok, J.G.,
Molar heat capacities and vapour pressures of solid and liquid benzophenone,
The Journal of Chemical Thermodynamics, 1983, 15, 2, 129-136, https://doi.org/10.1016/0021-9614(83)90151-9
. [all data]
Colomina, Jimenez, et al., 1980
Colomina, M.; Jimenez, P.; Turrion, C.; Fernandez, J.A.; Monzon, C.,
An. Quim. Ser. A, 1980, 76, 245. [all data]
De Kruif and Van Ginkel, 1977
De Kruif, C.G.; Van Ginkel, C.H.D.,
Torsion-weighing effusion vapour-pressure measurements on organic compounds,
The Journal of Chemical Thermodynamics, 1977, 9, 8, 725-730, https://doi.org/10.1016/0021-9614(77)90015-5
. [all data]
DeKruif, van Ginkel, et al., 1975
DeKruif, C.G.; van Ginkel, C.H.D.; Voogd, J.,
Torsion-effusion vapour pressure measurements of organic compounds,
Conf. Int. Thermodyn. Chim. C. R. 4th, 1975, 8, 11-18. [all data]
Serpinskii, Voitkevich, et al., 1956
Serpinskii, V.V.; Voitkevich, S.A.; Lyuboshits, N.Y.,
Zh. Fiz. Khim., 1956, 30, 177. [all data]
Wolf and Weghofer, 1938
Wolf, K.L.; Weghofer, H.Z.,
Z. Phys. Chem. Abt. B, 1938, 39, 194. [all data]
Wolf and Trieschmann, 1934
Wolf, K.L.; Trieschmann, H.G.,
Z. Phys. Chem. Abt. B, 1934, 27, 376. [all data]
Wolf and Weghofer, 1938, 2
Wolf, K.L.; Weghofer, H.,
Uber sublimationswarmen,
Z. Phys. Chem., 1938, 39, 194-208. [all data]
Chirico, Knipmeyer, et al., 2002
Chirico, R.D.; Knipmeyer, S.E.; Steele, W.V.,
Heat capacities, enthalpy increments, and derived thermodynamic functions for benzophenone between the temperatures 5K and 440K,
The Journal of Chemical Thermodynamics, 2002, 34, 11, 1885-1895, https://doi.org/10.1016/S0021-9614(02)00261-6
. [all data]
Hanaya, Hikima, et al., 2002
Hanaya, Minoru; Hikima, Takaaki; Hatase, Minoru; Oguni, Masaharu,
Low-temperature adiabatic calorimetry of salol and benzophenone and microscopic observation of their crystallization: finding of homogeneous-nucleation-based crystallization,
The Journal of Chemical Thermodynamics, 2002, 34, 8, 1173-1193, https://doi.org/10.1006/jcht.2002.0976
. [all data]
Domalski and Hearing, 1996
Domalski, Eugene S.; Hearing, Elizabeth D.,
Heat Capacities and Entropies of Organic Compounds in the Condensed Phase. Volume III,
J. Phys. Chem. Ref. Data, 1996, 25, 1, 1, https://doi.org/10.1063/1.555985
. [all data]
Eykman, 1889
Eykman, J.F.,
Zur kryoskopischen Molekulargewichtsbestimmung,
Z. Physik. Chem., 1889, 4, 497-519. [all data]
Kiss, Nolan, et al., 1994
Kiss, G.; Nolan, S.P.; Hoff, C.D.,
Inorg. Chim. Acta, 1994, 227, 285. [all data]
Hunter and Lias, 1998
Hunter, E.P.; Lias, S.G.,
Evaluated Gas Phase Basicities and Proton Affinities of Molecules: An Update,
J. Phys. Chem. Ref. Data, 1998, 27, 3, 413-656, https://doi.org/10.1063/1.556018
. [all data]
Grimsrud, Caldwell, et al., 1985
Grimsrud, E.; Caldwell, G.; Kebarle, P.,
Electron affinities from electron transfer equilibria: A- + B = A + B-,
J. Am. Chem. Soc., 1985, 107, 4627. [all data]
Maeyama, Yagi, et al., 2008
Maeyama, T.; Yagi, I.; Fujii, A.; Mikami, N.,
Photoelectron spectroscopy of microsolvated benzophenone radical anions to reveal the origin of solvatochromic shifts in alcoholic media,
Chem. Phys. Lett., 2008, 457, 1-3, 18-22, https://doi.org/10.1016/j.cplett.2008.03.055
. [all data]
Huh, Kang, et al., 1999
Huh, C.; Kang, C.H.; Lee, H.W.; Nakamura, H.; Mishima, M.; Tsuno, Y.; Yamataka, H.,
Thermodynamic stabilities and resonance demand of aromatic radical anions in the gas phase,
Bull. Chem. Soc. Japan, 1999, 72, 5, 1083-1091, https://doi.org/10.1246/bcsj.72.1083
. [all data]
Fukuda and McIver, 1985
Fukuda, E.K.; McIver, R.T., Jr.,
Relative electron affinities of substituted benzophenones, nitrobenzenes, and quinones. [Anchored to EA(SO2) from 74CEL/BEN],
J. Am. Chem. Soc., 1985, 107, 2291. [all data]
Kebarle and Chowdhury, 1987
Kebarle, P.; Chowdhury, S.,
Electron affinities and electron transfer reactions,
Chem. Rev., 1987, 87, 513. [all data]
Chen and Wentworth, 1983
Chen, E.C.M.; Wentworth, W.E.,
Determination of molecular electron affinities using the electron capture detector in the pulse sampling mode at steady state,
J. Phys. Chem., 1983, 87, 45. [all data]
Grutzmacher and Schubert, 1979
Grutzmacher, H.-F.; Schubert, R.,
Substituent effects in the mass spectra of benzoyl hetarenes,
Org. Mass Spectrom., 1979, 14, 567. [all data]
Elder, Beynon, et al., 1976
Elder, J.F.; Beynon, J.H.; Cooks, R.G.,
The benzoyl ion. Thermochemistry and kinetic energy release,
Org. Mass Spectrom., 1976, 11, 415. [all data]
Krenmayr, Heller, et al., 1974
Krenmayr, P.; Heller, R.; Varmuza, K.,
Massenspektrometrische untersuchungen an benzophenon und substituierten benzophenonen. I. Ermittlung thermodynamischer grossen,
Org. Mass Spectrom., 1974, 9, 998. [all data]
Heller, Varmuza, et al., 1974
Heller, R.; Varmuza, K.; Krenmayr, P.,
Massenspektrometrische untersuchung des substituenteneffektes bei einfach substituierten benzophenonen,
Monatsh. Chem., 1974, 105, 787. [all data]
Benoit, 1973
Benoit, F.,
The benzoyl cation: The participation of isolated electronic excited states in the dissociation of molecular ions of the form [C6H5COX]+,
Org. Mass Spectrom., 1973, 7, 1407. [all data]
Iskakov and Potapov, 1971
Iskakov, L.I.; Potapov, V.K.,
Photionization and decomposition of benzaldehyde, acetophenone, and benzophenone,
High Energy Chem., 1971, 5, 238, In original 265. [all data]
Natalis and Franklin, 1965
Natalis, P.; Franklin, J.L.,
Ionization and dissociation of diphenyl and condensed ring aromatics by electron impact. II. Diphenylcarbonyls and ethers,
J. Phys. Chem., 1965, 69, 2943. [all data]
Foffani, Pignataro, et al., 1964
Foffani, A.; Pignataro, S.; Cantone, B.; Grasso, F.,
Ionization potentials and substituent effects for aromatic carbonyl compounds,
Z. Physik. Chem. (Frankfurt), 1964, 42, 221. [all data]
Terenin, 1961
Terenin, A.,
Charge transfer in organic solids, induced by light,
Proc. Chem. Soc., London, 1961, 321. [all data]
McAlduff and Bunbury, 1979
McAlduff, E.J.; Bunbury, D.L.,
Photoelectron spectra of some aromatic mono-and di-ketones,
J. Electron Spectrosc. Relat. Phenom., 1979, 17, 81. [all data]
Centineo, Fragala, et al., 1978
Centineo, G.; Fragala, I.; Bruno, G.; Spampinato, S.,
Photoelectron spectroscopy of benzophenone, acetophenone and their ortho-alkyl derivatives,
J. Mol. Struct., 1978, 44, 203. [all data]
Tudor, 1997
Tudor, E.,
Temperature dependence of the retention index for perfumery compounds on a SE-30 glass capillary column. I. Linear equations,
J. Chromatogr. A, 1997, 779, 1-2, 287-297, https://doi.org/10.1016/S0021-9673(97)00453-6
. [all data]
Asuming, Beauchamp, et al., 2005
Asuming, W.A.; Beauchamp, P.S.; Descalzo, J.T.; Dev, B.C.; Dev, V.; Frost, S.; Ma, C.W.,
Essential oil composition of four Lomatium Raf. species and their chemotaxonomy,
Biochem. Syst. Ecol., 2005, 33, 1, 17-26, https://doi.org/10.1016/j.bse.2004.06.005
. [all data]
Alissandrakis E., Tarantilis P.A., et al., 2007
Alissandrakis E.; Tarantilis P.A.; Harizanis P.C.; Polissiou M.,
Comparison of the volatile composition in thyme honeys from several origins in Greece,
J. Agric. Food Chem., 2007, 55, 20, 8152-8157, https://doi.org/10.1021/jf071442y
. [all data]
Ramsey, Lee, et al., 1980
Ramsey, J.D.; Lee, T.D.; Osselton, M.D.; Moffat, A.C.,
Gas-liquid chromatographic retention indices of 296 non-drug substances on SE-30 or OV-1 likely to be encountered in toxicological analyses,
J. Chromatogr., 1980, 184, 2, 185-206, https://doi.org/10.1016/S0021-9673(00)85641-1
. [all data]
Tudor, Moldovan, et al., 1999
Tudor, E.; Moldovan, D.; Zârna, N.,
Temperature dependence of the retention index for perfumery compounds on two carbowax-20M glass capillary columns with different film thickness. 2,
Rev. Roum. Chim., 1999, 44, 7, 665-675. [all data]
Quijano, Salamanca, et al., 2007
Quijano, C.E.; Salamanca, G.; Pino, J.A.,
Aroma volatile constituents of Colombian varieties of mango (Mangifera indica L.),
Flavour Fragr. J., 2007, 22, 5, 401-406, https://doi.org/10.1002/ffj.1812
. [all data]
Pino, Mesa, et al., 2005
Pino, J.A.; Mesa, J.; Muñoz, Y.; Martí, M.P.; Marbot, R.,
Volatile components from mango (Mangifera indica L.) cultivars,
J. Agric. Food Chem., 2005, 53, 6, 2213-2223, https://doi.org/10.1021/jf0402633
. [all data]
Kostiainen, 2000
Kostiainen, O.,
Gas Chromatography in Screening of Chemicals Related to the Chemical Weapons Convention
in Encyclopedia of Analytical Chemistry, Meyers, R.A., ed(s)., John Wiley Sons Ltd, Chichester, 2000, 963-979. [all data]
Shapi and Hesso, 1990
Shapi, M.M.; Hesso, A.,
Thermal decomposition of polystyrene volatile compounds from large-scale pyrolysis,
J. Anal. Appl. Pyrolysis, 1990, 18, 2, 143-161, https://doi.org/10.1016/0165-2370(90)80004-8
. [all data]
Yasuhara, Shiraishi, et al., 1997
Yasuhara, A.; Shiraishi, H.; Nishikawa, M.; Yamamoto, T.; Uehiro, T.; Nakasugi, O.; Okumura, T.; Kenmotsu, K.; Fukui, H.; Nagase, M.; Ono, Y.; Kawagoshi, Y.; Baba, K.; Noma, Y.,
Determination of organic components in leachates from hazardous waste disposal sites in Japan by gas chromatography-mass spectrometry,
J. Chromatogr. A, 1997, 774, 1-2, 321-332, https://doi.org/10.1016/S0021-9673(97)00078-2
. [all data]
Peng, Ding, et al., 1988
Peng, C.T.; Ding, S.F.; Hua, R.L.; Yang, Z.C.,
Prediction of Retention Indexes I. Structure-Retention Index Relationship on Apolar Columns,
J. Chromatogr., 1988, 436, 137-172, https://doi.org/10.1016/S0021-9673(00)94575-8
. [all data]
Ledauphin, Saint-Clair, et al., 2004
Ledauphin, J.; Saint-Clair, J.-F.; Lablanquie, O.; Guichard, H.; Founier, N.; Guichard, E.; Barillier, D.,
Identification of trace volatile compounds in freshly distilled calvados and cognac using preparative separations coupled with gas chromatography-mass spectrometry,
J. Agric. Food Chem., 2004, 52, 16, 5124-5134, https://doi.org/10.1021/jf040052y
. [all data]
Adamiec, Rossner, et al., 2001
Adamiec, J.; Rossner, J.; Velisek, J.; Cejpek, K.; Savel, J.,
Minor Strecker degradation products of phenylalanine and phenylglycine,
Eur. Food Res. Technol., 2001, 212, 2, 135-140, https://doi.org/10.1007/s002170000234
. [all data]
Kotowska, Zalikowski, et al., 2012
Kotowska, U.; Zalikowski, M.; Isidorov, V.A.,
HS-SPME/GC-MS analysis of volatile and semi-volatile organic compounds emitted from municipal sewage sludge,
Environ. Monit. Asses., 2012, 184, 5, 2893-2907, https://doi.org/10.1007/s10661-011-2158-8
. [all data]
Leffingwell and Alford, 2011
Leffingwell, J.; Alford, E.D.,
Volatile constituents of the giant pufball mushroom (Calvatia gigantea),
Leffingwell Rep., 2011, 4, 1-17. [all data]
Lazarevic, Radulovic, et al., 2010
Lazarevic, J.; Radulovic, N.; Palic, R.; Zlatkovic, B.,
Chemical Analusis of volatile constituents of Berula erecta (Hudson) Coville subsp. erecta (Apiaceae) from Serbia,
J. Essential Oil. Res., 2010, 22, 3, 153-156, https://doi.org/10.1080/10412905.2010.9700290
. [all data]
Radulovic, Blagojevic, et al., 2010
Radulovic, N.; Blagojevic, P.; Palic, R.,
Comparative study of the leaf volatiles of Arctostaphylos uva-ursi (L.) Spreng. and Vaccinium vitis-idaea L. (Ericaceae),
Molecules, 2010, 15, 9, 6168-6185, https://doi.org/10.3390/molecules15096168
. [all data]
Radulovic, Dordevic, et al., 2010
Radulovic, N.; Dordevic, N.; Markovic, M.; Palic, R.,
Volatile constituents of Glechoma Hirsuta Waldst. Kit. and G. Hederacea L. (Lamiaceae),
Bull. Chem. Soc. Ethiop., 2010, 24, 1, 67-76, https://doi.org/10.4314/bcse.v24i1.52962
. [all data]
Grung, Lichtenthaler, et al., 2007
Grung, M.; Lichtenthaler, R.; Ahel, M.; Tollefsen, K.-E.; Langford, K.; Thomas, K.V.,
Effects-directed analysis of organic toxicants in wastewater effluent from Zagreb, Croatia,
Chemosphere, 2007, 67, 1, 108-120, https://doi.org/10.1016/j.chemosphere.2006.09.021
. [all data]
Vasta, Ratel, et al., 2007
Vasta, V.; Ratel, J.; Engel, E.,
Mass Spectrometry Analysis of Volatile Compounds in Raw Meat for the Authentication of the Feeding Background of Farm Animals,
J. Agric. Food Chem., 2007, 55, 12, 4630-4639, https://doi.org/10.1021/jf063432n
. [all data]
Ozel, Gogus, et al., 2006
Ozel, M.Z.; Gogus, F.; Lewis, A.C.,
Comparison of direct thermal desorption with water distillation and superheated water extraction for the analysis of volatile components of Rosa damascena Mill. using GCxGC-TOF/MS,
Anal. Chim. Acta., 2006, 566, 2, 172-177, https://doi.org/10.1016/j.aca.2006.03.014
. [all data]
Valette, Fernandez, et al., 2006
Valette, L.; Fernandez, X.; Poulain, S.; Lizzani-Cuvelier, L.; Loiseau, A.-M.,
Chemical composition of the volatile extracts from Brassica oleracea L. var. botrytis 'Romanesco' cauliflower seeds,
Flavour Fragr. J., 2006, 21, 1, 107-110, https://doi.org/10.1002/ffj.1530
. [all data]
Dickschat, Martens, et al., 2005
Dickschat, J.S.; Martens, T.; Brinkhoff, T.; Simon, M.; Schulz, S.,
Volatiles released by a Streptomyces species isolated from the North Sea,
Chemistry and Biodiversity, 2005, 2, 7, 837-865, https://doi.org/10.1002/cbdv.200590062
. [all data]
Leffingwell and Alford, 2005
Leffingwell, J.C.; Alford, E.D.,
Volatile constituents of Perique tobacco,
Electron. J. Environ. Agric. Food Chem., 2005, 4, 2, 899-915. [all data]
Rohloff and Bones, 2005
Rohloff, J.; Bones, A.M.,
Volatile profiling of Arabidopsis thaliana - Putative olfactory compounds in plant communication,
Phytochemistry, 2005, 66, 16, 1941-1955, https://doi.org/10.1016/j.phytochem.2005.06.021
. [all data]
Park, Lee, et al., 2004
Park, B.-S.; Lee, K.-G.; Takeoka, G.R.,
Comparison of three sample preparation methods on the recovery of volatiles from taheebo (Tabebuia impetiginosa Martius ex DC),
Flavour Fragr. J., 2004, 19, 4, 287-292, https://doi.org/10.1002/ffj.1345
. [all data]
Boatright and Crum, 1997
Boatright, W.L.; Crum, A.D.,
Nonpolar-volatile lipids from soy protein isolates and hexane-defatted flakes,
J. Amer. Oil Chem. Soc., 1997, 74, 4, 461-467, https://doi.org/10.1007/s11746-997-0107-z
. [all data]
Okumura, 1991
Okumura, T.,
retention indices of environmental chemicals on methyl silicone capillary column,
Journal of Environmental Chemistry (Japan), 1991, 1, 2, 333-358, https://doi.org/10.5985/jec.1.333
. [all data]
Maurer and Pfleger, 1988
Maurer, H.; Pfleger, K.,
Toxicological detection of ethylenediamine and piperazine antihistamines and their metabolites in urine by computerized gas chromatography-mass spectrometry,
Fresenius Z. Anal. Chem., 1988, 331, 7, 744-756, https://doi.org/10.1007/BF01105612
. [all data]
Mondello, 2012
Mondello, L.,
HS-SPME-GCxGC-MS analysis of Yerba Mate (Ilex paraguariensis)
in Shimadzu GC-GC application compendium of comprehensive 2D GC, Vol. 1-5, Shimadzu Corp., 2012, 1-29. [all data]
Shivashankar, Roy, et al., 2012
Shivashankar, S.; Roy, T.K.; Moorthy, P.N.R.,
Headspace solid phase micro extraction and GC/MS analysis of the volatile components in seed and cake of Azadirachta indica A. juss,
Chem. Bull. of Politechnika Univ. Timisoara, Romania, 2012, 57(71), 1, 1-6. [all data]
Zhao, Li, et al., 2008
Zhao, Y.; Li, J.; Xu, Y.; Duan, H.; Fan, W.; Zhao, G.,
EXtraction, preparation and identification of volatile compounds in Changyu XO brandy,
Chinese J. Chromatogr., 2008, 26, 2, 212-222, https://doi.org/10.1016/S1872-2059(08)60014-0
. [all data]
Vinogradov, 2004
Vinogradov, B.A.,
Production, composition, properties and application of essential oils, 2004, retrieved from http://viness.narod.ru. [all data]
Machiels, van Ruth, et al., 2003
Machiels, D.; van Ruth, S.M.; Posthumus, M.A.; Istasse, L.,
Gas chromatography-olfactometry analysis of the volatile compounds of two commercial Irish beef meats,
Talanta, 2003, 60, 4, 755-764, https://doi.org/10.1016/S0039-9140(03)00133-4
. [all data]
Teai, Claude-Lafontaine, et al., 2001
Teai, T.; Claude-Lafontaine, A.; Schippa, C.; Cozzolino, F.,
Volatile compounds in fresh pulp of pineapple (Ananas comosus [L.] Merr.) from French Polynesia,
J. Essent. Oil Res., 2001, 13, 5, 314-318, https://doi.org/10.1080/10412905.2001.9712222
. [all data]
Oda, Yasuhara, et al., 1998
Oda, J.; Yasuhara, A.; Matsunaga, K.; Saito, Y.,
Identification of polycyclic aromatic hydrocarbons of the particulate accumulated in the tunnel duct of freeway and generation of their oxygenated derivatives,
Jpn. J. Toxicol. Environ. Health, 1998, 44, 5, 334-351, https://doi.org/10.1248/jhs1956.44.334
. [all data]
Zenkevich and Chupalov, 1996
Zenkevich, I.G.; Chupalov, A.A.,
New Possibilities of Chromato Mass Pectrometric Identification of Organic Compounds Using Increments of Gas Chromatographic Retention Indices of Molecular Structural Fragments,
Zh. Org. Khim. (Rus.), 1996, 32, 5, 656-666. [all data]
Zenkevich, 1994
Zenkevich, I.G.,
Contemporary State of Informational Maintenance for Gas Chromatographic Identification of Chlorinated Polycyclic Aromatic Compounds,
Zh. Ecol. Khim., 1994, 3, 2, 111-119. [all data]
Waggott and Davies, 1984
Waggott, A.; Davies, I.W.,
Identification of organic pollutants using linear temperature programmed retention indices (LTPRIs) - Part II, 1984, retrieved from http://dwi.defra.gov.uk/research/completed-research/reports/dwi0383.pdf. [all data]
Ardrey and Moffat, 1981
Ardrey, R.E.; Moffat, A.C.,
Gas-liquid chromatographic retention indices of 1318 substances of toxicological interest on SE-30 or OV-1 stationary phase,
J. Chromatogr., 1981, 220, 3, 195-252, https://doi.org/10.1016/S0021-9673(00)81925-1
. [all data]
Soria, Sanz, et al., 2008
Soria, A.C.; Sanz, J.; Martinez-Castro, I.,
SPME followed by GC-MS: a powerful technique for qualitative analysis of honey volatiles,
Eur. Food Res. Technol., 2008, 1-12. [all data]
López, Ezpeleta, et al., 2004
López, R.; Ezpeleta, E.; Sánchez, I.; Cacho, J.; Ferreira, V.,
Analysis of the aroma intensities of volatile compounds released from mild acid hydrolysates of odourless precursors extracted from Tempranillo and Grenache grapes using gas chromatography-olfactometry,
Food Chem., 2004, 88, 1, 95-103, https://doi.org/10.1016/j.foodchem.2004.01.025
. [all data]
Peng, Yang, et al., 1991
Peng, C.T.; Yang, Z.C.; Ding, S.F.,
Prediction of rentention idexes. II. Structure-retention index relationship on polar columns,
J. Chromatogr., 1991, 586, 1, 85-112, https://doi.org/10.1016/0021-9673(91)80028-F
. [all data]