Fenchone
- Formula: C10H16O
- Molecular weight: 152.2334
- IUPAC Standard InChIKey: LHXDLQBQYFFVNW-UHFFFAOYSA-N
- CAS Registry Number: 1195-79-5
- Chemical structure:
View 3d structure (requires JavaScript / HTML 5) - Species with the same structure:
- Other names: Bicyclo[2.2.1]heptan-2-one, 1,3,3-trimethyl-; 2-Norbornanone, 1,3,3-trimethyl-; 1,3,3-Trimethyl-2-norbornanone; 1,3,3-Trimethylbicyclo[2.2.1]heptan-2-one; 1,3,3-Trimethylnorcamphor; Bicyclo[2.2.1]heptane-2-one,1,3,3-trimethyl; Fenchon; 1,3,3-Trimethyl-2-norcamphanone; dl-Fenchone; NSC 122687; (.+/-.)-Fenchone; NSC 8896; 18492-37-0; 126-21-6; 3,3-dimethyl-8,9-dinorbornan-2-one

Gas phase ion energetics data

Data compiled as indicated in comments:
LLK - Sharon G. Lias, Rhoda D. Levin, and Sherif A. Kafafi
Ionization energy determinations
IE (eV) | Method | Reference | Comment |
---|---|---|---|
8.5 | PE | Frost, Westwood, et al., 1980 | LLK |
8.80 | PE | Frost, Westwood, et al., 1980 | Vertical value; LLK |

Van Den Dool and Kratz RI, non-polar column, custom temperature program

Column type | Active phase | I | Reference | Comment |
---|---|---|---|---|
Capillary | HP-5MS | 1096.4 | Andriamaharavo, 2014 | 30. m/0.25 mm/0.25 μm, He; Program: 60C (1 min) => 5 C/min => 210C => 10 C/min => 280C (15 min) |

References

Frost, Westwood, et al., 1980
Frost, D.C.; Westwood, N.P.C.; Werstiuk, N.H.,
Ultraviolet photoelectron spectra of 2-norbornanone, 2,5-norbornanedione. Their akyl derivatives and thio-analogues. An investigation of transannular interactions by photoelectron spectroscopy,
Can. J. Chem., 1980, 58, 1659. [all data]
Andriamaharavo, 2014
Andriamaharavo, N.R.,
Retention Data. NIST Mass Spectrometry Data Center., NIST Mass Spectrometry Data Center, 2014. [all data]