Benzene, (methylsulfinyl)-
- Formula: C7H8OS
- Molecular weight: 140.203
- IUPAC Standard InChIKey: JXTGICXCHWMCPM-UHFFFAOYSA-N
- CAS Registry Number: 1193-82-4
- Chemical structure:
View 3d structure (requires JavaScript / HTML 5) - Other names: Sulfoxide, methyl phenyl; (Methylsulfinyl)benzene; Methyl phenyl sulfoxide; Phenyl methyl sulfoxide; Thioanisole S-oxide; (methylsulphinyl)benzene

Reaction thermochemistry data

Data compiled by: Robert C. Dunbar
Individual Reactions
By formula: Li+ + C7H8OS = (Li+ • C7H8OS)
Quantity | Value | Units | Method | Reference | Comment |
---|---|---|---|---|---|
ΔrH° | 230. | kJ/mol | CIDC | Buncel, Decouzon, et al., 1997 |

Gas phase ion energetics data

Data compiled as indicated in comments:
LLK - Sharon G. Lias, Rhoda D. Levin, and Sherif A. Kafafi
Ionization energy determinations
IE (eV) | Method | Reference | Comment |
---|---|---|---|
8.85 | PE | Mohraz, Jian-qi, et al., 1981 | Vertical value; LLK |
8.79 | PE | Bock and Solouki, 1974 | Vertical value; LLK |

Ion clustering data

Data compiled by: Robert C. Dunbar
Clustering reactions
By formula: Li+ + C7H8OS = (Li+ • C7H8OS)
Quantity | Value | Units | Method | Reference | Comment |
---|---|---|---|---|---|
ΔrH° | 230. | kJ/mol | CIDC | Buncel, Decouzon, et al., 1997 |

References

Buncel, Decouzon, et al., 1997
Buncel, E.; Decouzon, M.; Formento, A.; Gal, J.-F.; Herreros, M.; Li, L.; Maria, P.-C.,
Lithium-Cation and Proton Affinities of Sulfoxides and Sulfones: A Fourier Transform Ion Cyclotron Resonance Study,
J. Am. Soc. Mass Spectrom., 1997, 8, 3, 262, https://doi.org/10.1016/S1044-0305(96)00255-3
. [all data]
Mohraz, Jian-qi, et al., 1981
Mohraz, M.; Jian-qi, W.; Heilbronner, E.; Solladie-Cavallo, A.; Matloubi-Moghadam, F.,
11. Some comments on the conformations of methyl phenyl sulfides, sulfoxides and sulfones,
Helv. Chim. Acta, 1981, 64, 97. [all data]
Bock and Solouki, 1974
Bock, H.; Solouki, B.,
Photoelektronenspektren und molekuleigenschaften, XXXV. Sulfoxide X2SO - beispiele fur den nutzen von korrelations - diagrammen bei der diskussion von substituenteneffekten und von geometrischen storungen,
Chem. Ber., 1974, 107, 2299. [all data]