3,3-Dimethylpiperidine
- Formula: C7H15N
- Molecular weight: 113.2007
- IUPAC Standard InChIKey: CDODDZJCEADUQQ-UHFFFAOYSA-N
- CAS Registry Number: 1193-12-0
- Chemical structure:
View 3d structure (requires JavaScript / HTML 5) - Other names: Piperidine, 3,3-dimethyl-

Phase change data

Data compiled by: Robert L. Brown and Stephen E. Stein
Quantity | Value | Units | Method | Reference | Comment |
---|---|---|---|---|---|
Tboil | 410.2 | K | N/A | Weast and Grasselli, 1989 |

Gas phase ion energetics data

Data compiled as indicated in comments:
LBLHLM - Sharon G. Lias, John E. Bartmess, Joel F. Liebman, John L. Holmes, Rhoda D. Levin, and W. Gary Mallard
Ionization energy determinations
IE (eV) | Method | Reference | Comment |
---|---|---|---|
8.05 ± 0.05 | PE | Rozeboom and Houk, 1982 | LBLHLM |

Normal alkane RI, non-polar column, custom temperature program

Column type | Active phase | I | Reference | Comment |
---|---|---|---|---|
Capillary | Methyl Silicone | 870. | Farkas, Héberger, et al., 2004 | Program: not specified |

References

Weast and Grasselli, 1989
CRC Handbook of Data on Organic Compounds, 2nd Editon, Weast,R.C and Grasselli, J.G., ed(s)., CRC Press, Inc., Boca Raton, FL, 1989, 1. [all data]
Rozeboom and Houk, 1982
Rozeboom, M.D.; Houk, K.N.,
Stereospecific alkyl group effects on amine lone-pair ionization potentials: Photoelectron spectra of alkylpiperidines,
J. Am. Chem. Soc., 1982, 104, 1189. [all data]
Farkas, Héberger, et al., 2004
Farkas, O.; Héberger, K.; Zenkevich, I.G.,
Quantitative structure-retention relationships. XIV. Prediction of gas chromatographic retention indices for saturated O-, N-, and S-heterocyclic compounds,
Chemom. Intell. Lab. Syst., 2004, 72, 2, 173-184, https://doi.org/10.1016/j.chemolab.2004.01.012
. [all data]