2,5-Dihydro-3-methyl-thiophene 1,1-dioxide
- Formula: C5H8O2S
- Molecular weight: 132.181
- IUPAC Standard InChIKey: FAYFWMOSHFCQPG-UHFFFAOYSA-N
- CAS Registry Number: 1193-10-8
- Chemical structure:

Gas phase thermochemistry data

Data compiled by: Hussein Y. Afeefy, Joel F. Liebman, and Stephen E. Stein
Quantity | Value | Units | Method | Reference | Comment |
---|---|---|---|---|---|
ΔfH°gas | -291.6 ± 2.2 | kJ/mol | Ccr | Mackle and McNally, 1969 | Authors reported energy of Combustion=-800.93 kcal/mol |

Condensed phase thermochemistry data

Data compiled by: Hussein Y. Afeefy, Joel F. Liebman, and Stephen E. Stein
Quantity | Value | Units | Method | Reference | Comment |
---|---|---|---|---|---|
ΔfH°solid | -355.6 ± 2.2 | kJ/mol | Ccr | Mackle and McNally, 1969 | Authors reported energy of Combustion=-800.93 kcal/mol |
Quantity | Value | Units | Method | Reference | Comment |
ΔcH°solid | -3357.4 ± 2.1 | kJ/mol | Ccr | Mackle and McNally, 1969 | Authors reported energy of Combustion=-800.93 kcal/mol |

Phase change data

Data compiled by: Hussein Y. Afeefy, Joel F. Liebman, and Stephen E. Stein
Quantity | Value | Units | Method | Reference | Comment |
---|---|---|---|---|---|
ΔsubH° | 64.0 | kJ/mol | V | Mackle and McNally, 1969 | Authors reported energy of Combustion=-800.93 kcal/mol |

Gas phase ion energetics data

Data compiled by: Sharon G. Lias, John E. Bartmess, Joel F. Liebman, John L. Holmes, Rhoda D. Levin, and W. Gary Mallard
Ionization energy determinations
IE (eV) | Method | Reference | Comment |
---|---|---|---|
9.84 | PE | Kuhn, Klessinger, et al., 1987 | Vertical value |

References

Mackle and McNally, 1969
Mackle, H.; McNally, D.V.,
Studies in the thermochemistry of sulphones. Part 9 - Thermochemistry of the butadiene and isoprene sulphones,
Trans. Faraday Soc., 1969, 65, 1738-1741. [all data]
Kuhn, Klessinger, et al., 1987
Kuhn, H.J.; Klessinger, M.; Ruscic, B.; Klasinc, L.,
On the empirical correlation schemes for ionization energies in ring compounds,
Int. J. Mass Spectrom. Ion Phys., 1987, 43, 147. [all data]