1-Methyl-hexahydroazepine
- Formula: C7H15N
- Molecular weight: 113.2007
- IUPAC Standard InChIKey: ZKUKXSWKWGHYKJ-UHFFFAOYSA-N
- CAS Registry Number: 1192-95-6
- Chemical structure:
View 3d structure (requires JavaScript / HTML 5) - Other names: hexahydro-1-methyl-1H-azepine; 1H-Azepine, hexahydro-1-methyl-

Gas phase ion energetics data

Data compiled by: Sharon G. Lias, Rhoda D. Levin, and Sherif A. Kafafi
Ionization energy determinations
IE (eV) | Method | Reference | Comment |
---|---|---|---|
8.29 ± 0.02 | PE | Yoshikawa, Hashimoto, et al., 1974 | Vertical value |

Normal alkane RI, non-polar column, custom temperature program

Column type | Active phase | I | Reference | Comment |
---|---|---|---|---|
Capillary | Methyl Silicone | 882. | Farkas, Héberger, et al., 2004 | Program: not specified |

References

Yoshikawa, Hashimoto, et al., 1974
Yoshikawa, K.; Hashimoto, M.; Morishima, I.,
Photoelectron spectroscopic study of cyclic amines. The relation between ionization potentials, basicities, and s character of the nitrogen lone pair electrons,
J. Am. Chem. Soc., 1974, 96, 288. [all data]
Farkas, Héberger, et al., 2004
Farkas, O.; Héberger, K.; Zenkevich, I.G.,
Quantitative structure-retention relationships. XIV. Prediction of gas chromatographic retention indices for saturated O-, N-, and S-heterocyclic compounds,
Chemom. Intell. Lab. Syst., 2004, 72, 2, 173-184, https://doi.org/10.1016/j.chemolab.2004.01.012
. [all data]