bromophenylmercury
- Formula: C6H5BrHg
- Molecular weight: 357.60
- CAS Registry Number: 1192-89-8

Condensed phase thermochemistry data

Data compiled by: José A. Martinho Simões
Quantity | Value | Units | Method | Reference | Comment |
---|---|---|---|---|---|
ΔfH°solid | 38.2 ± 3.1 | kJ/mol | Review | Martinho Simões | The enthalpy of formation relies on 281.4 ± 5.6 kJ/mol for the enthalpy of formation of Hg(Ph)2(l). |

Gas phase ion energetics data

Data compiled as indicated in comments:
LBLHLM - Sharon G. Lias, John E. Bartmess, Joel F. Liebman, John L. Holmes, Rhoda D. Levin, and W. Gary Mallard
LLK - Sharon G. Lias, Rhoda D. Levin, and Sherif A. Kafafi
Ionization energy determinations
IE (eV) | Method | Reference | Comment |
---|---|---|---|
9.1 | PE | Baidin, Chizhov, et al., 1981 | LLK |
8.77 ± 0.05 | PE | Baidin, Timoshenko, et al., 1985 | Vertical value; LBLHLM |
9.33 | PE | Baidin, Chizhov, et al., 1981 | Vertical value; LLK |

Reaction thermochemistry data

Data compiled by: José A. Martinho Simões
Individual Reactions
By formula: C12H10Hg (l) + Br2Hg (cr) = 2C6H5BrHg (cr)
Quantity | Value | Units | Method | Reference | Comment |
---|---|---|---|---|---|
ΔrH° | -8.48 ± 0.29 | kcal/mol | RSC | Hartley, Pritchard, et al., 1951 | Please also see Pedley and Rylance, 1977 and Cox and Pilcher, 1970. |

References

Martinho Simões
Martinho Simões, J.A.,
Private communication (see http://webbook.nist.gov/chemistry/om/). [all data]
Baidin, Chizhov, et al., 1981
Baidin, V.N.; Chizhov, Y.V.; Timoshenko, M.M.; Ustynyuk, Y.A.; Kritskaya, I.I.,
He(I) photoelectronic spectra of organic compounds with a mercury atom attached to an sp2 hybridized carbon,
Bull. Acad. Sci. USSR, Div. Chem. Sci., 1981, 2362. [all data]
Baidin, Timoshenko, et al., 1985
Baidin, V.N.; Timoshenko, M.M.; Chizhov, Y.V.; Ustynyuk, Y.A.; Kritskaya, I.I.,
Photoelectron spectra nad the structure of organomercury compounds,
J. Organomet. Chem., 1985, 292, 55. [all data]