Cyclopentanone, oxime
- Formula: C5H9NO
- Molecular weight: 99.1311
- IUPAC Standard InChIKey: YGNXYFLJZILPEK-UHFFFAOYSA-N
- CAS Registry Number: 1192-28-5
- Chemical structure:
View 3d structure (requires JavaScript / HTML 5) - Permanent link for this species. Use this link for bookmarking this species for future reference.

Phase change data

Data compiled by: Robert L. Brown and Stephen E. Stein
Quantity | Value | Units | Method | Reference | Comment |
---|---|---|---|---|---|
Tboil | 469.2 | K | N/A | Aldrich Chemical Company Inc., 1990 |

Gas phase ion energetics data

Data compiled as indicated in comments:
LLK - Sharon G. Lias, Rhoda D. Levin, and Sherif A. Kafafi
Ionization energy determinations
IE (eV) | Method | Reference | Comment |
---|---|---|---|
8.92 ± 0.03 | PI | Golubitskii, Kulikov, et al., 1979 | LLK |

Normal alkane RI, non-polar column, temperature ramp

Column type | Active phase | I | Reference | Comment |
---|---|---|---|---|
Capillary | OV-101 | 972. | Zenkevich, 2005 | 25. m/0.20 mm/0.10 μm, N2/He, 6. K/min; Tstart: 50. C; Tend: 250. C |

References

Aldrich Chemical Company Inc., 1990
Aldrich Chemical Company Inc.,
Catalog Handbook of Fine Chemicals, Aldrich Chemical Company, Inc., Milwaukee WI, 1990, 1. [all data]
Golubitskii, Kulikov, et al., 1979
Golubitskii, A.E.; Kulikov, N.S.; Zyakun, A.M.; Valovoi, V.A.; Alekseev, A.M.; Volkov, V.N.,
Photoionization mass spectra of alicyclic compounds with various substituents, and their ionization energies and appearance energies,
Bull. Acad. Sci. USSR, Div. Chem. Sci., 1979, 11, 2602. [all data]
Zenkevich, 2005
Zenkevich, I.G.,
Experimentally measured retention indices., 2005. [all data]