2,3-Dihydrothiophene 1,1-dioxide
- Formula: C4H6O2S
- Molecular weight: 118.154
- IUPAC Standard InChIKey: DYGJDTCGUUMUBL-UHFFFAOYSA-N
- CAS Registry Number: 1192-16-1
- Chemical structure:
View 3d structure (requires JavaScript / HTML 5) - Other names: Thiophene, 2,3-dihydro-, 1,1-dioxide; Sulfol-2-ene; α-Sulfolene; 2-Sulfolene

Gas phase thermochemistry data

Data compiled by: Hussein Y. Afeefy, Joel F. Liebman, and Stephen E. Stein
Quantity | Value | Units | Method | Reference | Comment |
---|---|---|---|---|---|
ΔfH°gas | -262.0 ± 3.1 | kJ/mol | Ccr | Mackle and McNally, 1969 | Reanalyzed by Pedley, Naylor, et al., 1986, Original value = -261.5 ± 1.7 kJ/mol; Authors reported energy of Combustion=-646.62 kcal/mol |

Condensed phase thermochemistry data

Data compiled by: Hussein Y. Afeefy, Joel F. Liebman, and Stephen E. Stein
Quantity | Value | Units | Method | Reference | Comment |
---|---|---|---|---|---|
ΔfH°solid | -323.2 ± 1.7 | kJ/mol | Ccr | Mackle and McNally, 1969 | Authors reported energy of Combustion=-646.62 kcal/mol |
Quantity | Value | Units | Method | Reference | Comment |
ΔcH°solid | -2710.4 ± 1.6 | kJ/mol | Ccr | Mackle and McNally, 1969 | Authors reported energy of Combustion=-646.62 kcal/mol |

Phase change data

Data compiled by: Hussein Y. Afeefy, Joel F. Liebman, and Stephen E. Stein
Quantity | Value | Units | Method | Reference | Comment |
---|---|---|---|---|---|
ΔsubH° | 61.5 | kJ/mol | V | Mackle and McNally, 1969 | Authors reported energy of Combustion=-646.62 kcal/mol |

Reaction thermochemistry data

Data compiled by: Hussein Y. Afeefy, Joel F. Liebman, and Stephen E. Stein
Individual Reactions
By formula: C4H6 + O2S = C4H6O2S
Quantity | Value | Units | Method | Reference | Comment |
---|---|---|---|---|---|
ΔrH° | -74.9 | kJ/mol | Eqk | Mackle and McNally, 1969 | gas phase |

Gas phase ion energetics data

Data compiled by: Sharon G. Lias, John E. Bartmess, Joel F. Liebman, John L. Holmes, Rhoda D. Levin, and W. Gary Mallard
Ionization energy determinations
IE (eV) | Method | Reference | Comment |
---|---|---|---|
10.0 | PE | Aitken, Gosney, et al., 1984 | |
10.28 | PE | Kuhn, Klessinger, et al., 1987 | Vertical value |
10.28 | PE | Aitken, Gosney, et al., 1984 | Vertical value |

References

Mackle and McNally, 1969
Mackle, H.; McNally, D.V.,
Studies in the thermochemistry of sulphones. Part 9 - Thermochemistry of the butadiene and isoprene sulphones,
Trans. Faraday Soc., 1969, 65, 1738-1741. [all data]
Pedley, Naylor, et al., 1986
Pedley, J.B.; Naylor, R.D.; Kirby, S.P.,
Thermochemical Data of Organic Compounds, Chapman and Hall, New York, 1986, 1-792. [all data]
Aitken, Gosney, et al., 1984
Aitken, R.A.; Gosney, I.; Farries, H.; Palmer, M.H.; Simpson, I.; Cadogan, J.I.G.; Tinley, E.J.,
Chemical repercussions of orbital interactions through bond and through space. The reactivity of the double bond in unsaturated cyclic sulphones towards aziridine formation and epoxidation,
Tetrahedron, 1984, 40, 2487. [all data]
Kuhn, Klessinger, et al., 1987
Kuhn, H.J.; Klessinger, M.; Ruscic, B.; Klasinc, L.,
On the empirical correlation schemes for ionization energies in ring compounds,
Int. J. Mass Spectrom. Ion Phys., 1987, 43, 147. [all data]