Germane, triethyl-
- Formula: C6H16Ge
- Molecular weight: 160.83
- CAS Registry Number: 1188-14-3

Condensed phase thermochemistry data

Data compiled by: José A. Martinho Simões
Quantity | Value | Units | Method | Reference | Comment |
---|---|---|---|---|---|
ΔfH°liquid | -153.3 ± 8.7 | kJ/mol | Review | Martinho Simões | |
Quantity | Value | Units | Method | Reference | Comment |
ΔcH°liquid | -5033.4 ± 8.4 | kJ/mol | CC-SB | Telnoi, Kolyakova, et al., 1969 |

Phase change data

Data compiled by: José A. Martinho Simões
Quantity | Value | Units | Method | Reference | Comment |
---|---|---|---|---|---|
ΔvapH° | 41.4 ± 6.3 | kJ/mol | CC-SB | Dillard, McNeill, et al., 1958 |

Gas phase ion energetics data

Data compiled by: Sharon G. Lias, Rhoda D. Levin, and Sherif A. Kafafi
Ionization energy determinations
IE (eV) | Method | Reference | Comment |
---|---|---|---|
9.6 | PE | Beltram, Fehlner, et al., 1980 | Vertical value |

Gas phase thermochemistry data

Data compiled by: José A. Martinho Simões
Quantity | Value | Units | Method | Reference | Comment |
---|---|---|---|---|---|
ΔfH°gas | -112. ± 11. | kJ/mol | Review | Martinho Simões |

References

Martinho Simões
Martinho Simões, J.A.,
Private communication (see http://webbook.nist.gov/chemistry/om/). [all data]
Telnoi, Kolyakova, et al., 1969
Telnoi, V.I.; Kolyakova, G.m.; Rabinovich, I.B.; Vyazankin, N.s.,
Thermochemistry of triethylsilane, -germane, and -stannane,
Dokl. Akad. Nauk SSSR, 1969, 185, 374. [all data]
Dillard, McNeill, et al., 1958
Dillard, C.R.; McNeill, E.H.; Simmons, D.E.; Yeldell, J.B.,
J. Am. Chem. Soc., 1958, 80, 3607. [all data]
Beltram, Fehlner, et al., 1980
Beltram, G.; Fehlner, T.P.; Mochida, K.; Kochi, J.K.,
UV photoelectron spectra of group IV alkyl hydrides,
J. Electron Spectrosc. Relat. Phenom., 1980, 18, 153. [all data]