S-Methyl-L-cysteine
- Formula: C4H9NO2S
- Molecular weight: 135.185
- IUPAC Standard InChIKey: IDIDJDIHTAOVLG-GSVOUGTGSA-N
- CAS Registry Number: 1187-84-4
- Chemical structure:
View 3d structure (requires JavaScript / HTML 5) - Other names: Alanine, 3-(methylthio)-, L-; L-CH3SCH2CH(NH2)COOH; L-Cysteine, S-methyl-

Gas phase ion energetics data

Data compiled as indicated in comments:
LBLHLM - Sharon G. Lias, John E. Bartmess, Joel F. Liebman, John L. Holmes, Rhoda D. Levin, and W. Gary Mallard
Ionization energy determinations
IE (eV) | Method | Reference | Comment |
---|---|---|---|
8.4 | PE | Cannington and Ham, 1983 | LBLHLM |
8.8 | PE | Cannington and Ham, 1983 | Vertical value; LBLHLM |

References

Cannington and Ham, 1983
Cannington, P.H.; Ham, N.S.,
He(I) and He(II) photoelectron spectra of glycine and related molecules,
J. Electron Spectrosc. Relat. Phenom., 1983, 32, 139. [all data]