p-Benzoquinone, 2,3,5,6-tetrachloro-
- Formula: C6Cl4O2
- Molecular weight: 245.875
- IUPAC Standard InChIKey: UGNWTBMOAKPKBL-UHFFFAOYSA-N
- CAS Registry Number: 118-75-2
- Chemical structure:
View 3d structure (requires JavaScript / HTML 5) - Other names: p-Chloranil; 2,5-Cyclohexadiene-1,4-dione, 2,3,5,6-tetrachloro-; α-Chloranil; Chloranil; Coversan; Dow Seed Disinfectant No. 5; ENT 3,797; Khloranil; Psorisan; Quinone Tetrachloride; Reranil; Spergon; Spergon I; Spergon Technical; Tetrachloro-p-benzoquinone; Tetrachloro-p-quinone; Tetrachloro-1,4-benzoquinone; Tetrachlorobenzoquinone; Tetrachloroquinone; Vulklor; 2,3,5,6-Tetrachloro-p-benzoquinone; 2,3,5,6-Tetrachloro-1,4-benzoquinone; 2,3,5,6-Tetrachlorobenzoquinone; 2,3,5,6-Tetrachloroquinone; 2,3,5,6-Tetrachloro-2,5-cyclohexadiene-1,4-dione; G-444E; G-25804; Geigy-444e; Tetrachloroparabenzoquinone; 1,4-Benzoquinone, 2,3,5,6-tetrachloro-; Tetrachlorquinone; ENT 3797; NSC 8432

Condensed phase thermochemistry data

Data compiled as indicated in comments:
ALS - Hussein Y. Afeefy, Joel F. Liebman, and Stephen E. Stein
DH - Eugene S. Domalski and Elizabeth D. Hearing
Quantity | Value | Units | Method | Reference | Comment |
---|---|---|---|---|---|
ΔfH°solid | -298. | kJ/mol | Ccb | Sjostrom, 1936 | At 318 K; ALS |
Quantity | Value | Units | Method | Reference | Comment |
ΔcH°solid | -2171.1 ± 8.4 | kJ/mol | Ccb | Smith, Bjellerup, et al., 1953 | Reanalyzed by Cox and Pilcher, 1970, Original value = -2179. ± 8. kJ/mol; ALS |
ΔcH°solid | -2156. | kJ/mol | Ccb | Sjostrom, 1936 | At 318 K; ALS |
ΔcH°solid | -2166. | kJ/mol | Ccb | Swietoslawski and Starczedska, 1925 | ALS |
Quantity | Value | Units | Method | Reference | Comment |
S°solid,1 bar | 258.4 | J/mol*K | N/A | Chihara and Masukane, 1973 | crystaline, I phase; DH |
Constant pressure heat capacity of solid
Cp,solid (J/mol*K) | Temperature (K) | Reference | Comment |
---|---|---|---|
193.8 | 298.15 | Chihara and Masukane, 1973 | crystaline, I phase; T = 11 to 300 K.; DH |

Phase change data

Data compiled as indicated in comments:
TRC - Thermodynamics Research Center, NIST Boulder Laboratories, Chris Muzny director
AC - William E. Acree, Jr., James S. Chickos
ALS - Hussein Y. Afeefy, Joel F. Liebman, and Stephen E. Stein
DH - Eugene S. Domalski and Elizabeth D. Hearing
Quantity | Value | Units | Method | Reference | Comment |
---|---|---|---|---|---|
Tfus | 568.13 | K | N/A | Donnelly, Drewes, et al., 1990 | Uncertainty assigned by TRC = 0.2 K; TRC |
Quantity | Value | Units | Method | Reference | Comment |
ΔsubH° | 98.742 | kJ/mol | V | Coolidge and Coolidge, 1927 | ALS |
Enthalpy of vaporization
ΔvapH (kJ/mol) | Temperature (K) | Reference | Comment |
---|---|---|---|
88.5 | 358. | Stull, 1947 | Based on data from 343. to 435. K.; AC |
Antoine Equation Parameters
log10(P) = A − (B / (T + C))
P = vapor pressure (bar)
T = temperature (K)
View plot Requires a JavaScript / HTML 5 canvas capable browser.
Temperature (K) | A | B | C | Reference | Comment |
---|---|---|---|---|---|
343.8 to 435.8 | 10.24926 | 4283.338 | -17.558 | Stull, 1947 | Coefficents calculated by NIST from author's data. |
Enthalpy of sublimation
ΔsubH (kJ/mol) | Temperature (K) | Method | Reference | Comment |
---|---|---|---|---|
98.7 ± 8.3 | 333. to 356. | QF | Coolidge and Coolidge, 1927 | See also Jones, 1960 and Cox and Pilcher, 1970, 2.; AC |
Enthalpy of fusion
ΔfusH (kJ/mol) | Temperature (K) | Reference | Comment |
---|---|---|---|
30.87 | 567.2 | Acree, 1991 | AC |
Enthalpy of phase transition
ΔHtrs (kJ/mol) | Temperature (K) | Initial Phase | Final Phase | Reference | Comment |
---|---|---|---|---|---|
0.038 | 92. | crystaline, II | crystaline, I | Chihara and Masukane, 1973 | Lambda transition, 70 to 100 K.; DH |
Entropy of phase transition
ΔStrs (J/mol*K) | Temperature (K) | Initial Phase | Final Phase | Reference | Comment |
---|---|---|---|---|---|
0.4 | 92. | crystaline, II | crystaline, I | Chihara and Masukane, 1973 | Lambda; DH |

Gas phase ion energetics data

Data compiled as indicated in comments:
LLK - Sharon G. Lias, Rhoda D. Levin, and Sherif A. Kafafi
B - John E. Bartmess
Electron affinity determinations
EA (eV) | Method | Reference | Comment |
---|---|---|---|
2.78 ± 0.10 | TDEq | Heinis, Chowdhury, et al., 1988 | ΔGea(423 K) = -62.6 kcal/mol; ΔSea (estimated) = -3.5 eu. Bound excited states: Brinkman, Gunther, et al., 1994; B |
2.754 ± 0.048 | IMRE | Fukuda and McIver, 1985 | ΔGea(355 K) = -62.3 kcal/mol; ΔSea =-3.5, est. from data in Heinis, Chowdhury, et al., 1988; B |
2.76 ± 0.20 | NBIE | Cooper, Frey, et al., 1978 | B |
2.45 ± 0.26 | SI | Farragher and Page, 1966 | The Magnetron method, lacking mass analysis, is not considered reliable.; B |
Ionization energy determinations
IE (eV) | Method | Reference | Comment |
---|---|---|---|
9.74 | PE | Sato, Seki, et al., 1981 | LLK |
9.90 ± 0.05 | PE | Dougherty and McGlynn, 1977 | Vertical value; LLK |

References

Sjostrom, 1936
Sjostrom, Av.G.,
De klorsubstituerade kinonernas och hydrokinonernas termokemi,
Svensk. Kim. Tidr., 1936, 48, 121-124. [all data]
Smith, Bjellerup, et al., 1953
Smith, L.; Bjellerup, L.; Krook, S.; Westermark, H.,
Heats of combustion of organic chloro compounds determined by the "quartz wool" method,
Acta Chem. Scand., 1953, 7, 65. [all data]
Cox and Pilcher, 1970
Cox, J.D.; Pilcher, G.,
Thermochemistry of Organic and Organometallic Compounds, Academic Press, New York, 1970, 1-636. [all data]
Swietoslawski and Starczedska, 1925
Swietoslawski, W.; Starczedska, H.,
Correction des donnees thermochimiques de M.A. Valeur,
J. Chem. Phys., 1925, 22, 399-401. [all data]
Chihara and Masukane, 1973
Chihara, H.; Masukane, K.,
Heat capacity of solid tetrachloro-p-benzoquinone(chloranil) between 11 and 300K. Phase transitions at 92K,
J. Chem. Phys., 1973, 59, 5397-5403. [all data]
Donnelly, Drewes, et al., 1990
Donnelly, J.R.; Drewes, L.A.; Johnson, R.L.; Munslow, W.D.; Knapp, K.K.; Sovocool, G.W.,
Purity and heat of fusion data for environmental standards as determined by differential scanning calorimetry,
Thermochim. Acta, 1990, 167, 2, 155, https://doi.org/10.1016/0040-6031(90)80476-F
. [all data]
Coolidge and Coolidge, 1927
Coolidge, A.S.; Coolidge, M.S.,
The sublimation pressures of substituted quinones and hydroquinones,
J. Am. Chem. Soc., 1927, 49, 100-104. [all data]
Stull, 1947
Stull, Daniel R.,
Vapor Pressure of Pure Substances. Organic and Inorganic Compounds,
Ind. Eng. Chem., 1947, 39, 4, 517-540, https://doi.org/10.1021/ie50448a022
. [all data]
Jones, 1960
Jones, A.H.,
Sublimation Pressure Data for Organic Compounds.,
J. Chem. Eng. Data, 1960, 5, 2, 196-200, https://doi.org/10.1021/je60006a019
. [all data]
Cox and Pilcher, 1970, 2
Cox, J.D.; Pilcher, G.,
Thermochemistry of Organic and Organometallic Compounds, Academic Press Inc., London, 1970, 643. [all data]
Acree, 1991
Acree, William E.,
Thermodynamic properties of organic compounds: enthalpy of fusion and melting point temperature compilation,
Thermochimica Acta, 1991, 189, 1, 37-56, https://doi.org/10.1016/0040-6031(91)87098-H
. [all data]
Heinis, Chowdhury, et al., 1988
Heinis, T.; Chowdhury, S.; Scott, S.L.; Kebarle, P.,
Electron Affinities of Benzo-, Naphtho-, and Anthraquinones Determined from Gas-Phase Equilibria Measurements,
J. Am. Chem. Soc., 1988, 110, 2, 400, https://doi.org/10.1021/ja00210a015
. [all data]
Brinkman, Gunther, et al., 1994
Brinkman, E.A.; Gunther, E.; Schafer, O.; Brauman, J.I.,
Bound Excited Electronic States of Anions,
J. Chem. Phys., 1994, 100, 3, 1840, https://doi.org/10.1063/1.466535
. [all data]
Fukuda and McIver, 1985
Fukuda, E.K.; McIver, R.T., Jr.,
Relative electron affinities of substituted benzophenones, nitrobenzenes, and quinones. [Anchored to EA(SO2) from 74CEL/BEN],
J. Am. Chem. Soc., 1985, 107, 2291. [all data]
Cooper, Frey, et al., 1978
Cooper, C.D.; Frey, W.F.; Compton, R.N.,
Negative ion properties of fluoranil, chloranil, and bromanil: Electron affinities,
J. Chem. Phys., 1978, 69, 2367. [all data]
Farragher and Page, 1966
Farragher, A.L.; Page, F.M.,
Experimental Determination of Electron Affinities. Part 9. - Benzoquinone, Chloranil and Related Compounds,
Trans. Farad. Soc., 1966, 62, 3072, https://doi.org/10.1039/tf9666203072
. [all data]
Sato, Seki, et al., 1981
Sato, N.; Seki, K.; Inokuchi, H.,
Polarization energies of organic solids determined by ultraviolet photoelectron spectroscopy,
J. Chem. Soc. Faraday Trans. 2, 1981, 77, 1621. [all data]
Dougherty and McGlynn, 1977
Dougherty, D.; McGlynn, S.P.,
Photoelectron spectroscopy of carbonyls. 1,4-Benzoquinones,
J. Am. Chem. Soc., 1977, 99, 3234. [all data]
Perkampus and Braunschweig, 1966
Perkampus, H.-H.; Braunschweig, T.H.,
UV atlas of organic compouds, 1966, 1, B8/5. [all data]