2,2-Dimethylvaleric acid
- Formula: C7H14O2
- Molecular weight: 130.1849
- IUPAC Standard InChIKey: ZRYCZAWRXHAAPZ-UHFFFAOYSA-N
- CAS Registry Number: 1185-39-3
- Chemical structure:
View 3d structure (requires JavaScript / HTML 5) - Other names: Pentanoic acid, 2,2-dimethyl-; Valeric acid, 2,2-dimethyl-; 2,2-Dimethylpentanoic acid; α,α-Dimethylvaleric acid

Phase change data

Data compiled as indicated in comments:
BS - Robert L. Brown and Stephen E. Stein
TRC - Thermodynamics Research Center, NIST Boulder Laboratories, Chris Muzny director
Quantity | Value | Units | Method | Reference | Comment |
---|---|---|---|---|---|
Tboil | 470. | K | N/A | Frinton Laboratories Inc., 1986 | BS |
Tboil | 420.6 | K | N/A | Eidus, Puzitskii, et al., 1960 | Uncertainty assigned by TRC = 2. K; TRC |
Tboil | 423.7 | K | N/A | Eidus, Puzitskii, et al., 1960 | Uncertainty assigned by TRC = 2. K; TRC |

Gas phase ion energetics data

Data compiled by: Sharon G. Lias, Rhoda D. Levin, and Sherif A. Kafafi
Appearance energy determinations
Ion | AE (eV) | Other Products | Method | Reference | Comment |
---|---|---|---|---|---|
C4H8O2+ | 9.96 | C3H6 | EI | Holmes and Lossing, 1980 |

References

Frinton Laboratories Inc., 1986
Frinton Laboratories Inc.,
Catalog Number 11, Frinton Laboratories Inc., Vineland, NJ, 1986, 99. [all data]
Eidus, Puzitskii, et al., 1960
Eidus, Y.T.; Puzitskii, K.V.; Sterligov, O.D.,
Synthesis of Esters and Other Derivatives of Carboxylic Acis by Acid Catalysis from Carbon Monoxide, Olefins, and Acylating Compounds,
Zh. Obshch. Khim., 1960, 30, 3799-3802. [all data]
Holmes and Lossing, 1980
Holmes, J.L.; Lossing, F.P.,
Gas-phase heats of formation of keto and enol ions of carbonyl compounds.,
J. Am. Chem. Soc., 1980, 102, 1591. [all data]