Propanedial, dimethyl-
- Formula: C5H8O2
- Molecular weight: 100.1158
- IUPAC Standard InChIKey: WNBFTLCNQKKVHC-UHFFFAOYSA-N
- CAS Registry Number: 1185-34-8
- Chemical structure:
View 3d structure (requires JavaScript / HTML 5) - Permanent link for this species. Use this link for bookmarking this species for future reference.

Gas phase ion energetics data

Data compiled by: Sharon G. Lias, Rhoda D. Levin, and Sherif A. Kafafi
Ionization energy determinations
IE (eV) | Method | Reference | Comment |
---|---|---|---|
9.8 | PE | Schweig, Vermeer, et al., 1974 | Vertical value |

References

Schweig, Vermeer, et al., 1974
Schweig, A.; Vermeer, H.; Weidner, U.,
A photoelectron spectroscopic study of keto-enol tautomerism in acetylacetones - a new application of photoelectron spectroscopy,
Chem. Phys. Lett., 1974, 26, 229. [all data]