Methanamine, N,N-dimethyl-, N-oxide
- Formula: C3H9NO
- Molecular weight: 75.1097
- IUPAC Standard InChIKey: UYPYRKYUKCHHIB-UHFFFAOYSA-N
- CAS Registry Number: 1184-78-7
- Chemical structure:

Gas phase ion energetics data

Data evaluated as indicated in comments:
HL - Edward P. Hunter and Sharon G. Lias
Data compiled as indicated in comments:
LLK - Sharon G. Lias, Rhoda D. Levin, and Sherif A. Kafafi
Quantity | Value | Units | Method | Reference | Comment |
---|---|---|---|---|---|
Proton affinity (review) | 235.0 | kcal/mol | N/A | Hunter and Lias, 1998 | HL |
Quantity | Value | Units | Method | Reference | Comment |
Gas basicity | 227.9 | kcal/mol | N/A | Hunter and Lias, 1998 | HL |
Ionization energy determinations
IE (eV) | Method | Reference | Comment |
---|---|---|---|
8.375 ± 0.035 | PE | Elbel and Dieck, 1976 | Vertical value; LLK |
8.27 | PE | Wieczorek, Koenig, et al., 1975 | Vertical value; LLK |

References

Hunter and Lias, 1998
Hunter, E.P.; Lias, S.G.,
Evaluated Gas Phase Basicities and Proton Affinities of Molecules: An Update,
J. Phys. Chem. Ref. Data, 1998, 27, 3, 413-656, https://doi.org/10.1063/1.556018
. [all data]
Elbel and Dieck, 1976
Elbel, S.; Dieck, H.t.,
Photoelectron spectra of group 5 compounds. Part IV. A study of the E-X bond in R3EX compounds (R = Me or F; E = N or P; X = O or S),
J. Chem. Soc. Dalton Trans., 1976, 1757. [all data]
Wieczorek, Koenig, et al., 1975
Wieczorek, J.S.; Koenig, T.; Balle, T.,
The He(I) photoelectron spectra of amine n-oxides,
J. Electron Spectrosc. Relat. Phenom., 1975, 6, 215. [all data]