Dichlone
- Formula: C10H4Cl2O2
- Molecular weight: 227.044
- IUPAC Standard InChIKey: SVPKNMBRVBMTLB-UHFFFAOYSA-N
- CAS Registry Number: 117-80-6
- Chemical structure:
View 3d structure (requires JavaScript / HTML 5) - Other names: 1,4-Naphthalenedione, 2,3-dichloro-; 1,4-Naphthoquinone, 2,3-dichloro-; Algistat; Compound 604; Diclone; Phygon; Phygon Seed Protectant; Phygon XL; Sanquinon; USR 604; 2,3-Dichloro-1,4-naphthalenedione; 2,3-Dichloro-1,4-naphthoquinone; 2,3-Dichloro-1,4-naphthaquinone; CNQ; Dichloronaphthoquinone; ENT 3,776; U.S. rubber 604; Uniroyal; 2,3-Dichlor-1,4-naphthochinon; 2,3-Dichloro-α-naphthoquinone; 2,3-Dichloronaphthoquinone; 2,3-Dichloronaphthoquinone-1,4; 2,3-Dichlor-1,4-naftochinon; Latka 604; Phygon paste; Quintar; Quintar 540F; NSC 537; 2,3-Dichloro-1,4-naphthoquinone (dichlone)

Phase change data

Data compiled as indicated in comments:
TRC - Thermodynamics Research Center, NIST Boulder Laboratories, Chris Muzny director
AC - William E. Acree, Jr., James S. Chickos
Quantity | Value | Units | Method | Reference | Comment |
---|---|---|---|---|---|
Tfus | 469.56 | K | N/A | Donnelly, Drewes, et al., 1990 | Uncertainty assigned by TRC = 0.2 K; TRC |
Enthalpy of fusion
ΔfusH (kJ/mol) | Temperature (K) | Method | Reference | Comment |
---|---|---|---|---|
28.53 | 469. | DSC | Acree, 1991 | See also Donnelly, Drewes, et al., 1990, 2.; AC |

Gas phase ion energetics data

Data compiled as indicated in comments:
LLK - Sharon G. Lias, Rhoda D. Levin, and Sherif A. Kafafi
B - John E. Bartmess
Electron affinity determinations
EA (eV) | Method | Reference | Comment |
---|---|---|---|
2.21 ± 0.10 | TDEq | Heinis, Chowdhury, et al., 1988 | ΔGea(423 K) = 49.4 kcal/mol; ΔSea = -3.5 eu; B |
Ionization energy determinations
IE (eV) | Method | Reference | Comment |
---|---|---|---|
9.5 | PE | Redchenko, Freimanis, et al., 1980 | LLK |
9.67 ± 0.02 | PE | Redchenko, Freimanis, et al., 1980 | LLK |

Kovats' RI, non-polar column, custom temperature program

Column type | Active phase | I | Reference | Comment |
---|---|---|---|---|
Packed | SE-30 | 1760. | Ramsey, Lee, et al., 1980 | He, Chromosorb G HP (80-100 mesh); Column length: 1.5 m; Program: not specified |

Normal alkane RI, non-polar column, custom temperature program

Column type | Active phase | I | Reference | Comment |
---|---|---|---|---|
Capillary | OV-1, SE-30, Methyl silicone, SP-2100, OV-101, DB-1, etc. | 1760. | Waggott and Davies, 1984 | Hydrogen; Column length: 50. m; Column diameter: 0.32 mm; Program: not specified |

References

Donnelly, Drewes, et al., 1990
Donnelly, J.R.; Drewes, L.A.; Johnson, R.L.; Munslow, W.D.; Knapp, K.K.; Sovocool, G.W.,
Purity and heat of fusion data for environmental standards as determined by differential scanning calorimetry,
Thermochim. Acta, 1990, 167, 2, 155, https://doi.org/10.1016/0040-6031(90)80476-F
. [all data]
Acree, 1991
Acree, William E.,
Thermodynamic properties of organic compounds: enthalpy of fusion and melting point temperature compilation,
Thermochimica Acta, 1991, 189, 1, 37-56, https://doi.org/10.1016/0040-6031(91)87098-H
. [all data]
Donnelly, Drewes, et al., 1990, 2
Donnelly, J.R.; Drewes, L.A.; Johnson, R.L.; Munslow, W.D.; Knapp, K.K.; Sovocool, G.W.,
Purity and heat of fusion data for environmental standards as determined by differential scanning calorimetry,
Thermochimica Acta, 1990, 167, 2, 155-187, https://doi.org/10.1016/0040-6031(90)80476-F
. [all data]
Heinis, Chowdhury, et al., 1988
Heinis, T.; Chowdhury, S.; Scott, S.L.; Kebarle, P.,
Electron Affinities of Benzo-, Naphtho-, and Anthraquinones Determined from Gas-Phase Equilibria Measurements,
J. Am. Chem. Soc., 1988, 110, 2, 400, https://doi.org/10.1021/ja00210a015
. [all data]
Redchenko, Freimanis, et al., 1980
Redchenko, V.V.; Freimanis, Y.F.; Dregeris, Y.Y.,
Photoelectron Spectroscopy of 2,3-Disubtituted naphthoquinones,
J. Gen. Chem. USSR, 1980, 50, 1507, In original 1847. [all data]
(editor), 1976
(editor), Koptyug V.A.,
Atlas of Spectra of Aromatic and Heterocyclic Compounds, 1976, 10, 6. [all data]
Ramsey, Lee, et al., 1980
Ramsey, J.D.; Lee, T.D.; Osselton, M.D.; Moffat, A.C.,
Gas-liquid chromatographic retention indices of 296 non-drug substances on SE-30 or OV-1 likely to be encountered in toxicological analyses,
J. Chromatogr., 1980, 184, 2, 185-206, https://doi.org/10.1016/S0021-9673(00)85641-1
. [all data]
Waggott and Davies, 1984
Waggott, A.; Davies, I.W.,
Identification of organic pollutants using linear temperature programmed retention indices (LTPRIs) - Part II, 1984, retrieved from http://dwi.defra.gov.uk/research/completed-research/reports/dwi0383.pdf. [all data]