1,3-Isobenzofurandione, 4,5,6,7-tetrachloro-
- Formula: C8Cl4O3
- Molecular weight: 285.896
- IUPAC Standard InChIKey: AUHHYELHRWCWEZ-UHFFFAOYSA-N
- CAS Registry Number: 117-08-8
- Chemical structure:
View 3d structure (requires JavaScript / HTML 5) - Other names: Phthalic anhydride, tetrachloro-; Niagathal; Tetrachlorophthalic anhydride; 1,3-Dioxo-4,5,6,7-tetrachloroisobenzofuran; NCI-C61585; 3,4,5,6-Tetrachlorophthalic anhydride; Tetrachlorophthalic acid anhydride; 4,5,6,7-Tetrachloro-isobenzofuran-1,3-dione; 4,5,6,7-Tetrachloro-1,3-isobenzofurandione; Tetrathal; 1,3-Isobenzofurandione, tetrachloro-; 1,3-Dioxy-4,5,6,7-tetrachloroisobenzofuran; NSC 1484

Phase change data

Data compiled by: Robert L. Brown and Stephen E. Stein
Quantity | Value | Units | Method | Reference | Comment |
---|---|---|---|---|---|
Tboil | 644.2 | K | N/A | Aldrich Chemical Company Inc., 1990 |

Gas phase ion energetics data

Data compiled as indicated in comments:
RDSH - Henry M. Rosenstock, Keith Draxl, Bruce W. Steiner, and John T. Herron
B - John E. Bartmess
Electron affinity determinations
EA (eV) | Method | Reference | Comment |
---|---|---|---|
1.956 ± 0.087 | IMRE | Paul and Kebarle, 1989 | ΔGea(423 K) = -43.8±1 kcal/mol, ΔS(est) = -3±3 eu; B |
Ionization energy determinations
IE (eV) | Method | Reference | Comment |
---|---|---|---|
10.8 ± 0.2 | EI | Grutzmacher and Hubner, 1969 | RDSH |
Appearance energy determinations
Ion | AE (eV) | Other Products | Method | Reference | Comment |
---|---|---|---|---|---|
C6Cl4+ | 14.3 ± 0.2 | ? | EI | Grutzmacher and Hubner, 1969 | RDSH |

Normal alkane RI, non-polar column, temperature ramp

Column type | Active phase | I | Reference | Comment |
---|---|---|---|---|
Capillary | Polydimethyl siloxane | 2029. | Hayakawa, Niinomi, et al., 1990 | 25. m/0.32 mm/0.52 μm, He, 6. K/min; Tstart: 60. C; Tend: 270. C |

References

Aldrich Chemical Company Inc., 1990
Aldrich Chemical Company Inc.,
Catalog Handbook of Fine Chemicals, Aldrich Chemical Company, Inc., Milwaukee WI, 1990, 1. [all data]
Paul and Kebarle, 1989
Paul, G.; Kebarle, P.,
Electron Affinities of Cyclic Unsaturated Dicarbonyls: Maleic Anhydrides, Maleimides, and Cyclopentendione,
J. Am. Chem. Soc., 1989, 111, 2, 464, https://doi.org/10.1021/ja00184a009
. [all data]
Grutzmacher and Hubner, 1969
Grutzmacher, H.-F.; Hubner, J.,
Massenspektrometrie instabiler molekule. III: Nachweis und untersuchungen zur stabilitat chlorsubstituierter dehydrobenzole in der gasphase,
Org. Mass Spectrom., 1969, 2, 649. [all data]
Hayakawa, Niinomi, et al., 1990
Hayakawa, S.; Niinomi, J.; Kato, S.; Kanamaru, T.,
Retention time and mass number of agrochemicals by capillary column GC/MS,
Mie-ken Kankyo-Kagaku Senta-kenkyu-ho-koku (Report of the Environmental Science Institute of Mie Prefecture), 1990, 10, 53-56. [all data]