m,m-Quaterphenyl
- Formula: C24H18
- Molecular weight: 306.3997
- IUPAC Standard InChIKey: OWPJBAYCIXEHFA-UHFFFAOYSA-N
- CAS Registry Number: 1166-18-3
- Chemical structure:
View 3d structure (requires JavaScript / HTML 5) - Other names: 1,1':3',1'':3'',1'''-Quaterphenyl; m-Quaterphenyl; 1,1'-Biphenyl, 3,3'-diphenyl-; 3,3'-Diphenylbiphenyl; m-Tetraphenyl

Condensed phase thermochemistry data

Data compiled by: Eugene S. Domalski and Elizabeth D. Hearing
Constant pressure heat capacity of liquid
Cp,liquid (J/mol*K) | Temperature (K) | Reference | Comment |
---|---|---|---|
553.5 | 370. | Walker, Brooks, et al., 1958 | T = 200 to 600°F. |

Gas phase ion energetics data

Data compiled by: Henry M. Rosenstock, Keith Draxl, Bruce W. Steiner, and John T. Herron
Ionization energy determinations
IE (eV) | Method | Reference |
---|---|---|
8.51 ± 0.05 | EI | Gallegos, 1967 |
Appearance energy determinations
Ion | AE (eV) | Other Products | Method | Reference | Comment |
---|---|---|---|---|---|
C18H10+ | 18.3 ± 0.3 | ? | EI | Gallegos, 1967 | |
C18H12+ | 16.7 ± 0.3 | ? | EI | Gallegos, 1967 |

Van Den Dool and Kratz RI, non-polar column, temperature ramp

Column type | Active phase | I | Reference | Comment |
---|---|---|---|---|
Capillary | SE-52 | 2923. | Beernaert, 1979 | He, 50. C @ 5. min, 6. K/min; Column length: 33.3 m; Column diameter: 0.50 mm; Tend: 320. C |

Lee's RI, non-polar column, temperature ramp

Column type | Active phase | I | Reference | Comment |
---|---|---|---|---|
Capillary | SE-52 | 472.81 | Lee, Vassilaros, et al., 1979 | 12. m/0.3 mm/0.34 μm, He, 2. K/min; Tstart: 50. C; Tend: 250. C |

Lee's RI, non-polar column, custom temperature program

Column type | Active phase | I | Reference | Comment |
---|---|---|---|---|
Capillary | SE-52 | 470.68 | Shlyakhov, 1984 | Program: not specified |
Capillary | SE-52 | 472.81 | Shlyakhov, 1984 | Program: not specified |

References

Walker, Brooks, et al., 1958
Walker, B.E., Jr.; Brooks, M.S.; Ewing, C.T.; Miller, R.R.,
Specific heat of biphenyl and other polyphenyls. Correlation of specific heat data for phenyl type compounds,
J. Chem. Eng. Data, 1958, 3, 280-282. [all data]
Gallegos, 1967
Gallegos, E.J.,
Mass spectrometry of some polyphenyls,
J. Phys. Chem., 1967, 71, 1647. [all data]
Ibiri, et al., 1975
Ibiri, E., et al.,
Bull. Chem. Soc. Japan, 1975, 48, 1868. [all data]
Beernaert, 1979
Beernaert, H.,
Gas Chromatographic Analysis of Polyclylic Aromatic Hydrocarbons,
J. Chromatogr., 1979, 173, 1, 109-118, https://doi.org/10.1016/S0021-9673(01)80450-7
. [all data]
Lee, Vassilaros, et al., 1979
Lee, M.L.; Vassilaros, D.L.; White, C.M.; Novotny, M.,
Retention Indices for Programmed-Temperature Capillary-Column Gas Chromatography of Polycyclic Aromatic Hydrocarbons,
Anal. Chem., 1979, 51, 6, 768-773, https://doi.org/10.1021/ac50042a043
. [all data]
Shlyakhov, 1984
Shlyakhov, A.F.,
Gas chromatography in organic geochemistry, Nedra, Moscow, 1984, 221. [all data]