Rhodium, η5-trifluoromethylcyclopentadienyl-
- Formula: C8H4F3O2Rh
- Molecular weight: 292.0169
- CAS Registry Number: 115406-90-1

Gas phase ion energetics data

Data compiled by: Sharon G. Lias and Joel F. Liebman
Ionization energy determinations
IE (eV) | Method | Reference | Comment |
---|---|---|---|
7.97 | PE | Lichtenberger and Renshaw, 1991 | Vertical value |

References

Lichtenberger and Renshaw, 1991
Lichtenberger, D.L.; Renshaw, S.K.,
Photoelectron spectroscopy and rates of CO substitution of (η5-C5H4X)Rh(CO)2 compounds. Separation of and ring substituent effects,
Organometallics, 1991, 10, 148. [all data]