Pent-1-yn-3-yl
- Formula: C5H7
- Molecular weight: 67.1091
- IUPAC Standard InChIKey: PHBDUZYYMFTIDN-UHFFFAOYSA-N
- CAS Registry Number: 115236-80-1
- Chemical structure:
View 3d structure (requires JavaScript / HTML 5) - Other names: Pent-1-yn-3-yl radical

Gas phase ion energetics data

Data compiled by: Sharon G. Lias, Rhoda D. Levin, and Sherif A. Kafafi
Ionization energy determinations
IE (eV) | Method | Reference |
---|---|---|
7.6 | DER | Lossing and Traeger, 1975 |

References

Lossing and Traeger, 1975
Lossing, F.P.; Traeger, J.C.,
Free radicals by mass spectrometry XLVI. Heats of formation of C5H7 and C5H9 radicals and cations.,
J. Am. Chem. Soc., 1975, 19, 9. [all data]