Propene
- Formula: C3H6
- Molecular weight: 42.0797
- IUPAC Standard InChIKey: QQONPFPTGQHPMA-UHFFFAOYSA-N
- CAS Registry Number: 115-07-1
- Chemical structure:
View 3d structure (requires JavaScript / HTML 5) - Isotopologues:
- Other names: Propylene; 1-Propene; Methylethylene; 1-Propylene; CH3CH=CH2; Methylethene; NCI-C50077; UN 1077; R 1270

Gas phase thermochemistry data

Data compiled as indicated in comments:
ALS - Hussein Y. Afeefy, Joel F. Liebman, and Stephen E. Stein
GT - Glushko Thermocenter, Russian Academy of Sciences, Moscow
Quantity | Value | Units | Method | Reference | Comment |
---|---|---|---|---|---|
ΔfH°gas | 4.879 | kcal/mol | Eqk | Furuyama, Golden, et al., 1969 | ALS |
ΔfH°gas | 4.879 | kcal/mol | Cm | Lacher, Walden, et al., 1950 | Heat of hydrobromination; ALS |
Quantity | Value | Units | Method | Reference | Comment |
ΔcH°gas | -491.83 ± 0.27 | kcal/mol | Cm | Wiberg and Fenoglio, 1968 | Corresponding ΔfHºgas = 4.73 kcal/mol (simple calculation by NIST; no Washburn corrections); ALS |
ΔcH°gas | -491.8 ± 0.1 | kcal/mol | Cm | Rossini and Knowlton, 1937 | Reanalyzed by Cox and Pilcher, 1970, Original value = -491.74 ± 0.15 kcal/mol; Corresponding ΔfHºgas = 4.71 kcal/mol (simple calculation by NIST; no Washburn corrections); ALS |
Constant pressure heat capacity of gas
Cp,gas (cal/mol*K) | Temperature (K) | Reference | Comment |
---|---|---|---|
8.210 | 50. | Thermodynamics Research Center, 1997 | p=1 bar. Recommended entropies and heat capacities are in good agreement with other statistically calculated values [ Crawford B.L., 1939, Kilpatrick J.E., 1946, Kilpatrick J.E., 1947, Chao J., 1975] as well as with ab initio value of S(298.15 K)=266.82 J/mol*K [ East A.L.L., 1997].; GT |
9.338 | 100. | ||
10.60 | 150. | ||
12.01 | 200. | ||
14.45 | 273.15 | ||
15.37 | 298.15 | ||
15.44 | 300. | ||
19.23 | 400. | ||
22.75 | 500. | ||
25.813 | 600. | ||
28.463 | 700. | ||
30.765 | 800. | ||
32.772 | 900. | ||
34.522 | 1000. | ||
36.049 | 1100. | ||
37.380 | 1200. | ||
38.540 | 1300. | ||
39.551 | 1400. | ||
40.435 | 1500. | ||
42.194 | 1750. | ||
43.475 | 2000. | ||
44.429 | 2250. | ||
45.151 | 2500. | ||
45.707 | 2750. | ||
46.147 | 3000. |
Constant pressure heat capacity of gas
Cp,gas (cal/mol*K) | Temperature (K) | Reference | Comment |
---|---|---|---|
10.64 | 148.2 | Bier K., 1974 | Please also see Kistiakowsky G.B., 1940, Kistiakowsky G.B., 1940, 2, Telfair D., 1942.; GT |
10.86 | 157.6 | ||
12.48 | 213.1 | ||
12.69 | 220.1 | ||
12.83 | 223.7 | ||
13.97 | 258.0 | ||
14.29 | 270. | ||
14.36 ± 0.031 | 272.29 | ||
14.69 | 280. | ||
15.16 | 291.1 | ||
15.25 ± 0.031 | 298.15 | ||
15.47 ± 0.031 | 299.33 | ||
15.47 | 300. | ||
16.23 | 320. | ||
16.22 ± 0.033 | 323.15 | ||
16.74 ± 0.041 | 333.86 | ||
16.98 | 340. | ||
17.16 ± 0.033 | 348.15 | ||
17.72 | 360. | ||
17.80 ± 0.036 | 365.15 | ||
17.93 ± 0.02 | 367.11 | ||
18.11 ± 0.036 | 373.15 | ||
19.08 ± 0.038 | 378.15 | ||
18.44 | 380. | ||
19.16 | 400. | ||
19.88 | 420. | ||
19.98 ± 0.041 | 423.15 | ||
20.58 | 440. | ||
20.90 ± 0.041 | 448.15 | ||
21.28 | 460. | ||
21.79 ± 0.043 | 473.15 | ||
21.97 | 480. | ||
22.65 | 500. | ||
22.99 | 510. |

Condensed phase thermochemistry data

Data compiled by: Eugene S. Domalski and Elizabeth D. Hearing
Quantity | Value | Units | Method | Reference | Comment |
---|---|---|---|---|---|
S°liquid | 46.77 | cal/mol*K | N/A | Chao, Hall, et al., 1983 |
Constant pressure heat capacity of liquid
Cp,liquid (cal/mol*K) | Temperature (K) | Reference | Comment |
---|---|---|---|
24.4 | 298.15 | Chao, Hall, et al., 1983 | T = 14 to 340 K. |
23.6 | 300. | Auerbach, Sage, et al., 1950 | T = 300 to 344 K. Datum at 80°C is Cp at the bubble point, 0.5615 Btu/lb*R. |
22.01 | 230. | Powell and Giauque, 1939 | T = 14 to 225 K. |
21.5 | 210.3 | Huffman, Parks, et al., 1931 | T = 69 to 210 K. Value is unsmoothed experimental datum. |

Phase change data

Data compiled as indicated in comments:
BS - Robert L. Brown and Stephen E. Stein
TRC - Thermodynamics Research Center, NIST Boulder Laboratories, Chris Muzny director
DH - Eugene S. Domalski and Elizabeth D. Hearing
AC - William E. Acree, Jr., James S. Chickos
Quantity | Value | Units | Method | Reference | Comment |
---|---|---|---|---|---|
Tboil | 225.6 ± 0.6 | K | AVG | N/A | Average of 9 values; Individual data points |
Quantity | Value | Units | Method | Reference | Comment |
Tfus | 88.0 | K | N/A | Streng, 1971 | Uncertainty assigned by TRC = 0.3 K; TRC |
Tfus | 87.9 | K | N/A | Haselden and Snowden, 1962 | Uncertainty assigned by TRC = 0.4 K; TRC |
Tfus | 88.25 | K | N/A | Parks and Huffman, 1931 | Uncertainty assigned by TRC = 1. K; TRC |
Tfus | 87.95 | K | N/A | Coffin and Maass, 1927 | Uncertainty assigned by TRC = 0.6 K; TRC |
Quantity | Value | Units | Method | Reference | Comment |
Ttriple | 87.8 ± 0.8 | K | AVG | N/A | Average of 6 values; Individual data points |
Quantity | Value | Units | Method | Reference | Comment |
Ptriple | 9.38 | atm | N/A | Angus, Armstrong, et al., 1980 | Uncertainty assigned by TRC = 0.15 atm; TRC |
Quantity | Value | Units | Method | Reference | Comment |
Tc | 365.2 ± 0.8 | K | AVG | N/A | Average of 6 values; Individual data points |
Quantity | Value | Units | Method | Reference | Comment |
Pc | 45.4 ± 0.3 | atm | N/A | Tsonopoulos and Ambrose, 1996 | |
Pc | 45.19 | atm | N/A | Ohgaki, Umezono, et al., 1990 | Uncertainty assigned by TRC = 0.15 atm; TRC |
Pc | 46.036 | atm | N/A | Angus, Armstrong, et al., 1980 | Uncertainty assigned by TRC = 1.97 atm; TRC |
Pc | 45.61 | atm | N/A | Marchman, Prengle, et al., 1949 | Uncertainty assigned by TRC = 0.1499 atm; TRC |
Pc | 45.3460 | atm | N/A | Seibert and Burrell, 1915 | Uncertainty assigned by TRC = 0.3289 atm; TRC |
Quantity | Value | Units | Method | Reference | Comment |
Vc | 0.1846 | l/mol | N/A | Tsonopoulos and Ambrose, 1996 | |
Vc | 0.192 | l/mol | N/A | Marchman, Prengle, et al., 1949 | Uncertainty assigned by TRC = 0.005 l/mol; TRC |
Quantity | Value | Units | Method | Reference | Comment |
ρc | 5.42 ± 0.03 | mol/l | N/A | Tsonopoulos and Ambrose, 1996 | |
ρc | 5.549 | mol/l | N/A | Ohgaki, Umezono, et al., 1990 | Uncertainty assigned by TRC = 0.07 mol/l; TRC |
ρc | 5.309 | mol/l | N/A | Angus, Armstrong, et al., 1980 | Uncertainty assigned by TRC = 0.36 mol/l; TRC |
Quantity | Value | Units | Method | Reference | Comment |
ΔvapH° | 3.834 | kcal/mol | N/A | Majer and Svoboda, 1985 |
Enthalpy of vaporization
ΔvapH (kcal/mol) | Temperature (K) | Method | Reference | Comment |
---|---|---|---|---|
4.402 | 225.5 | N/A | Majer and Svoboda, 1985 | |
4.4020 | 225.35 | N/A | Powell and Giauque, 1939 | DH |
4.47 | 312. | A | Stephenson and Malanowski, 1987 | Based on data from 297. to 363. K.; AC |
5.31 | 146. | A | Stephenson and Malanowski, 1987 | Based on data from 104. to 161. K.; AC |
4.47 | 256. | A | Stephenson and Malanowski, 1987 | Based on data from 228. to 271. K.; AC |
4.42 | 285. | A | Stephenson and Malanowski, 1987 | Based on data from 270. to 327. K.; AC |
4.49 | 340. | A | Stephenson and Malanowski, 1987 | Based on data from 325. to 363. K.; AC |
4.59 | 227. | A | Stephenson and Malanowski, 1987 | Based on data from 161. to 242. K. See also Dykyj, 1970.; AC |
4.47 | 360. | N/A | Michels, Wassenaar, et al., 1953 | Based on data from 298. to 423. K.; AC |
4.68 | 211. | N/A | Powell and Giauque, 1939 | Based on data from 166. to 226. K.; AC |
4.61 | 268. | N/A | Maass and Wright, 1921 | Based on data from 236. to 283. K. See also Boublik, Fried, et al., 1984.; AC |
Entropy of vaporization
ΔvapS (cal/mol*K) | Temperature (K) | Reference | Comment |
---|---|---|---|
19.53 | 225.35 | Powell and Giauque, 1939 | DH |
Antoine Equation Parameters
log10(P) = A − (B / (T + C))
P = vapor pressure (atm)
T = temperature (K)
View plot Requires a JavaScript / HTML 5 canvas capable browser.
Temperature (K) | A | B | C | Reference | Comment |
---|---|---|---|---|---|
165.81 to 225.98 | 3.96917 | 795.819 | -24.884 | Powell and Giauque, 1939 | Coefficents calculated by NIST from author's data. |
Enthalpy of fusion
ΔfusH (kcal/mol) | Temperature (K) | Reference | Comment |
---|---|---|---|
0.7177 | 87.85 | Chao, Hall, et al., 1983 | DH |
0.7175 | 87.85 | Powell and Giauque, 1939 | DH |
0.7010 | 88.2 | Huffman, Parks, et al., 1931 | DH |
0.700 | 88.2 | Domalski and Hearing, 1996 | AC |
Entropy of fusion
ΔfusS (cal/mol*K) | Temperature (K) | Reference | Comment |
---|---|---|---|
8.169 | 87.85 | Chao, Hall, et al., 1983 | DH |
8.169 | 87.85 | Powell and Giauque, 1939 | DH |
7.96 | 88.2 | Huffman, Parks, et al., 1931 | DH |
Temperature of phase transition
Ttrs (K) | Initial Phase | Final Phase | Reference | Comment |
---|---|---|---|---|
56.0 | crystaline | glass | Takeda, Oguni, et al., 1990 | DH |

Reaction thermochemistry data

Data compiled as indicated in comments:
B - John E. Bartmess
ALS - Hussein Y. Afeefy, Joel F. Liebman, and Stephen E. Stein
M - Michael M. Meot-Ner (Mautner) and Sharon G. Lias
RCD - Robert C. Dunbar
Individual Reactions
C3H5- + =
Quantity | Value | Units | Method | Reference | Comment |
---|---|---|---|---|---|
ΔrH° | 391.10 ± 0.30 | kcal/mol | G+TS | Ellison, Davico, et al., 1996 | gas phase; calculated dSacid=24.2±1.0 eu; B |
ΔrH° | 390.5 ± 1.0 | kcal/mol | D-EA | Wenthold, Polak, et al., 1996 | gas phase; B |
ΔrH° | 390.7 ± 2.1 | kcal/mol | G+TS | Bartmess, Scott, et al., 1979 | gas phase; value altered from reference due to change in acidity scale; B |
ΔrH° | 390.25 ± 0.65 | kcal/mol | G+TS | Mackay, Lien, et al., 1978 | gas phase; B |
Quantity | Value | Units | Method | Reference | Comment |
ΔrG° | 383.80 ± 0.10 | kcal/mol | IMRE | Ellison, Davico, et al., 1996 | gas phase; calculated dSacid=24.2±1.0 eu; B |
ΔrG° | 383.9 ± 1.1 | kcal/mol | H-TS | Wenthold, Polak, et al., 1996 | gas phase; B |
ΔrG° | 384.1 ± 2.0 | kcal/mol | IMRE | Bartmess, Scott, et al., 1979 | gas phase; value altered from reference due to change in acidity scale; B |
ΔrG° | 383.60 ± 0.50 | kcal/mol | IMRE | Mackay, Lien, et al., 1978 | gas phase; B |
By formula: HBr + C3H6 = C3H7Br
Quantity | Value | Units | Method | Reference | Comment |
---|---|---|---|---|---|
ΔrH° | -20.43 | kcal/mol | Cm | Lacher, Kianpour, et al., 1957 | gas phase; ALS |
ΔrH° | -20.050 | kcal/mol | Cm | Lacher, Lea, et al., 1950 | gas phase; Heat of hydrobromination at 367°K; ALS |
ΔrH° | -20.10 ± 0.14 | kcal/mol | Cm | Lacher, Walden, et al., 1950 | gas phase; Reanalyzed by Cox and Pilcher, 1970, Original value = -20.17 ± 0.24 kcal/mol; Heat of hydrobromination; ALS |
Quantity | Value | Units | Method | Reference | Comment |
---|---|---|---|---|---|
ΔrH° | -29.5 ± 1.2 | kcal/mol | Chyd | Kistiakowsky and Nickle, 1951 | gas phase; Reanalyzed by Cox and Pilcher, 1970, Original value = -29.85 ± 0.50 kcal/mol; ALS |
ΔrH° | -29.87 ± 0.10 | kcal/mol | Chyd | Kistiakowsky, Ruhoff, et al., 1935 | gas phase; Reanalyzed by Cox and Pilcher, 1970, Original value = -30.115 ± 0.013 kcal/mol; At 355 °K; ALS |
C3H5- + =
Quantity | Value | Units | Method | Reference | Comment |
---|---|---|---|---|---|
ΔrH° | 405.8 ± 2.0 | kcal/mol | Bran | DePuy, Gronert, et al., 1989 | gas phase; B |
ΔrH° | >404.75 ± 0.60 | kcal/mol | G+TS | Froelicher, Freiser, et al., 1986 | gas phase; B |
Quantity | Value | Units | Method | Reference | Comment |
ΔrG° | 398.0 ± 2.1 | kcal/mol | H-TS | DePuy, Gronert, et al., 1989 | gas phase; B |
ΔrG° | >397.00 | kcal/mol | IMRB | Froelicher, Freiser, et al., 1986 | gas phase; B |
By formula: HI + C3H5I = C3H6 + I2
Quantity | Value | Units | Method | Reference | Comment |
---|---|---|---|---|---|
ΔrH° | -7.96 ± 0.33 | kcal/mol | Eqk | Rodgers, Golden, et al., 1966 | gas phase; ALS |
ΔrH° | -9.5 ± 1.0 | kcal/mol | Eqk | Rodgers, Golden, et al., 1966 | gas phase; Reanalyzed by Cox and Pilcher, 1970, Original value = -8.33 ± 0.23 kcal/mol; At 527 K; ALS |
By formula: C3H7Cl = C3H6 + HCl
Quantity | Value | Units | Method | Reference | Comment |
---|---|---|---|---|---|
ΔrH° | 17.3 ± 0.2 | kcal/mol | Eqk | Noren and Sunner, 1970 | gas phase; ALS |
ΔrH° | 17.62 ± 0.15 | kcal/mol | Eqk | Kabo and Andreevskii, 1963 | gas phase; At 415.5 K; ALS |
ΔrH° | 17.45 ± 0.50 | kcal/mol | Eqk | Howlett, 1955 | gas phase; ALS |
By formula: Co+ + C3H6 = (Co+ • C3H6)
Enthalpy of reaction
ΔrH° (kcal/mol) | T (K) | Method | Reference | Comment |
---|---|---|---|---|
43.0 (+1.7,-0.) | CID | Armentrout and Kickel, 1994 | gas phase; guided ion beam CID; M | |
43.1 (+1.6,-0.) | CID | Haynes and Armentrout, 1994 | gas phase; guided ion beam CID; M |
By formula: C3H9Si+ + C3H6 = (C3H9Si+ • C3H6)
Quantity | Value | Units | Method | Reference | Comment |
---|---|---|---|---|---|
ΔrH° | 30.6 | kcal/mol | PHPMS | Li and Stone, 1989 | gas phase; condensation; M |
Quantity | Value | Units | Method | Reference | Comment |
ΔrS° | 42.5 | cal/mol*K | PHPMS | Li and Stone, 1989 | gas phase; condensation; M |
By formula: C3H6 + Br2 = C3H6Br2
Quantity | Value | Units | Method | Reference | Comment |
---|---|---|---|---|---|
ΔrH° | -29.27 ± 0.20 | kcal/mol | Cm | Conn, Kistiakowsky, et al., 1938 | gas phase; Reanalyzed by Cox and Pilcher, 1970, Original value = -29.41 ± 0.20 kcal/mol; At 355 °K; ALS |
C3H5- + =
Quantity | Value | Units | Method | Reference | Comment |
---|---|---|---|---|---|
ΔrH° | >404.75 ± 0.90 | kcal/mol | G+TS | Froelicher, Freiser, et al., 1986 | gas phase; B |
Quantity | Value | Units | Method | Reference | Comment |
ΔrG° | >397.00 | kcal/mol | IMRB | Froelicher, Freiser, et al., 1986 | gas phase; B |
By formula: Li+ + C3H6 = (Li+ • C3H6)
Quantity | Value | Units | Method | Reference | Comment |
---|---|---|---|---|---|
ΔrH° | 23. | kcal/mol | ICR | Staley and Beauchamp, 1975 | gas phase; switching reaction(Li+)H2O, from graph; Dzidic and Kebarle, 1970 extrapolated; M |
By formula: Rh+ + C3H6 = (Rh+ • C3H6)
Enthalpy of reaction
ΔrH° (kcal/mol) | T (K) | Method | Reference | Comment |
---|---|---|---|---|
28.1 | CID | Chen and Armetrout, 1995 | gas phase; ΔrH>=, guided ion beam CID; M |
By formula: Fe+ + C3H6 = (Fe+ • C3H6)
Enthalpy of reaction
ΔrH° (kcal/mol) | T (K) | Method | Reference | Comment |
---|---|---|---|---|
34.7 (+1.7,-0.) | CID | Armentrout and Kickel, 1994 | gas phase; guided ion beam CID; M |
(CAS Reg. No. 25012-80-0 • 4294967295) +
= CAS Reg. No. 25012-80-0
By formula: (CAS Reg. No. 25012-80-0 • 4294967295C3H6) + C3H6 = CAS Reg. No. 25012-80-0
Quantity | Value | Units | Method | Reference | Comment |
---|---|---|---|---|---|
ΔrH° | 10.8 ± 2.1 | kcal/mol | N/A | DePuy, Gronert, et al., 1989 | gas phase; B |
(CAS Reg. No. 59513-13-2 • 4294967295) +
= CAS Reg. No. 59513-13-2
By formula: (CAS Reg. No. 59513-13-2 • 4294967295C3H6) + C3H6 = CAS Reg. No. 59513-13-2
Quantity | Value | Units | Method | Reference | Comment |
---|---|---|---|---|---|
ΔrH° | 14.6 ± 2.1 | kcal/mol | N/A | DePuy, Gronert, et al., 1989 | gas phase; B |
By formula: C3H6 + HCl = C3H7Cl
Quantity | Value | Units | Method | Reference | Comment |
---|---|---|---|---|---|
ΔrH° | -17.54 | kcal/mol | Eqk | Kabo and Andreevskii, 1963 | gas phase; At 385°K; ALS |
Quantity | Value | Units | Method | Reference | Comment |
---|---|---|---|---|---|
ΔrH° | -20.62 | kcal/mol | Eqk | Furuyama, Golden, et al., 1969 | gas phase; ALS |
By formula: C3H6 + H2O4S = isopropyl hydrogen sulphate
Quantity | Value | Units | Method | Reference | Comment |
---|---|---|---|---|---|
ΔrH° | -9.2 ± 0.2 | kcal/mol | Eqk | Entelis, Korovina, et al., 1960 | liquid phase; ALS |
By formula: C3H6I2 = C3H6 + I2
Quantity | Value | Units | Method | Reference | Comment |
---|---|---|---|---|---|
ΔrH° | 11.2 ± 0.4 | kcal/mol | Eqk | Benson and Amano, 1962 | gas phase; ALS |
By formula: C3H7Br = HBr + C3H6
Quantity | Value | Units | Method | Reference | Comment |
---|---|---|---|---|---|
ΔrH° | 19.3 ± 0.5 | kcal/mol | Eqk | Rozhnov and Andreevskii, 1962 | gas phase; ALS |
By formula: C3H6 + C3F6O = C6H6F6O
Quantity | Value | Units | Method | Reference | Comment |
---|---|---|---|---|---|
ΔrH° | -18.7 ± 1.0 | kcal/mol | Eqk | Moore, 1971 | gas phase; ALS |
By formula: Au+ + C3H6 = (Au+ • C3H6)
Quantity | Value | Units | Method | Reference | Comment |
---|---|---|---|---|---|
ΔrH° | >75. | kcal/mol | IMRB | Schroeder, Hrusak, et al., 1995 | RCD |

Henry's Law data

Data compiled by: Rolf Sander
Henry's Law constant (water solution)
kH(T) = k°H exp(d(ln(kH))/d(1/T) ((1/T) - 1/(298.15 K)))
k°H = Henry's law constant for solubility in water at 298.15 K (mol/(kg*bar))
d(ln(kH))/d(1/T) = Temperature dependence constant (K)
k°H (mol/(kg*bar)) | d(ln(kH))/d(1/T) (K) | Method | Reference | Comment |
---|---|---|---|---|
0.0048 | Q | N/A | missing citation give several references for the Henry's law constants but don't assign them to specific species. | |
0.0048 | L | N/A | ||
0.0074 | 3400. | L | N/A | |
0.0048 | V | N/A |

Gas phase ion energetics data

Data evaluated as indicated in comments:
HL - Edward P. Hunter and Sharon G. Lias
L - Sharon G. Lias
Data compiled as indicated in comments:
B - John E. Bartmess
LBLHLM - Sharon G. Lias, John E. Bartmess, Joel F. Liebman, John L. Holmes, Rhoda D. Levin, and W. Gary Mallard
LLK - Sharon G. Lias, Rhoda D. Levin, and Sherif A. Kafafi
RDSH - Henry M. Rosenstock, Keith Draxl, Bruce W. Steiner, and John T. Herron
Quantity | Value | Units | Method | Reference | Comment |
---|---|---|---|---|---|
IE (evaluated) | 9.73 ± 0.01 | eV | N/A | N/A | L |
Quantity | Value | Units | Method | Reference | Comment |
Proton affinity (review) | 179.6 | kcal/mol | N/A | Hunter and Lias, 1998 | HL |
Quantity | Value | Units | Method | Reference | Comment |
Gas basicity | 172.7 | kcal/mol | N/A | Hunter and Lias, 1998 | HL |
Ionization energy determinations
Appearance energy determinations
De-protonation reactions
C3H5- + =
Quantity | Value | Units | Method | Reference | Comment |
---|---|---|---|---|---|
ΔrH° | 391.10 ± 0.30 | kcal/mol | G+TS | Ellison, Davico, et al., 1996 | gas phase; calculated dSacid=24.2±1.0 eu; B |
ΔrH° | 390.5 ± 1.0 | kcal/mol | D-EA | Wenthold, Polak, et al., 1996 | gas phase; B |
ΔrH° | 390.7 ± 2.1 | kcal/mol | G+TS | Bartmess, Scott, et al., 1979 | gas phase; value altered from reference due to change in acidity scale; B |
ΔrH° | 390.25 ± 0.65 | kcal/mol | G+TS | Mackay, Lien, et al., 1978 | gas phase; B |
Quantity | Value | Units | Method | Reference | Comment |
ΔrG° | 383.80 ± 0.10 | kcal/mol | IMRE | Ellison, Davico, et al., 1996 | gas phase; calculated dSacid=24.2±1.0 eu; B |
ΔrG° | 383.9 ± 1.1 | kcal/mol | H-TS | Wenthold, Polak, et al., 1996 | gas phase; B |
ΔrG° | 384.1 ± 2.0 | kcal/mol | IMRE | Bartmess, Scott, et al., 1979 | gas phase; value altered from reference due to change in acidity scale; B |
ΔrG° | 383.60 ± 0.50 | kcal/mol | IMRE | Mackay, Lien, et al., 1978 | gas phase; B |
C3H5- + =
Quantity | Value | Units | Method | Reference | Comment |
---|---|---|---|---|---|
ΔrH° | 405.8 ± 2.0 | kcal/mol | Bran | DePuy, Gronert, et al., 1989 | gas phase; B |
ΔrH° | >404.75 ± 0.60 | kcal/mol | G+TS | Froelicher, Freiser, et al., 1986 | gas phase; B |
Quantity | Value | Units | Method | Reference | Comment |
ΔrG° | 398.0 ± 2.1 | kcal/mol | H-TS | DePuy, Gronert, et al., 1989 | gas phase; B |
ΔrG° | >397.00 | kcal/mol | IMRB | Froelicher, Freiser, et al., 1986 | gas phase; B |
C3H5- + =
Quantity | Value | Units | Method | Reference | Comment |
---|---|---|---|---|---|
ΔrH° | >404.75 ± 0.90 | kcal/mol | G+TS | Froelicher, Freiser, et al., 1986 | gas phase; B |
Quantity | Value | Units | Method | Reference | Comment |
ΔrG° | >397.00 | kcal/mol | IMRB | Froelicher, Freiser, et al., 1986 | gas phase; B |

Ion clustering data

Data compiled as indicated in comments:
RCD - Robert C. Dunbar
M - Michael M. Meot-Ner (Mautner) and Sharon G. Lias
Clustering reactions
By formula: Au+ + C3H6 = (Au+ • C3H6)
Quantity | Value | Units | Method | Reference | Comment |
---|---|---|---|---|---|
ΔrH° | >75. | kcal/mol | IMRB | Schroeder, Hrusak, et al., 1995 | RCD |
By formula: C3H9Si+ + C3H6 = (C3H9Si+ • C3H6)
Quantity | Value | Units | Method | Reference | Comment |
---|---|---|---|---|---|
ΔrH° | 30.6 | kcal/mol | PHPMS | Li and Stone, 1989 | gas phase; condensation; M |
Quantity | Value | Units | Method | Reference | Comment |
ΔrS° | 42.5 | cal/mol*K | PHPMS | Li and Stone, 1989 | gas phase; condensation; M |
By formula: Co+ + C3H6 = (Co+ • C3H6)
Enthalpy of reaction
ΔrH° (kcal/mol) | T (K) | Method | Reference | Comment |
---|---|---|---|---|
43.0 (+1.7,-0.) | CID | Armentrout and Kickel, 1994 | gas phase; guided ion beam CID; M | |
43.1 (+1.6,-0.) | CID | Haynes and Armentrout, 1994 | gas phase; guided ion beam CID; M |
By formula: Fe+ + C3H6 = (Fe+ • C3H6)
Enthalpy of reaction
ΔrH° (kcal/mol) | T (K) | Method | Reference | Comment |
---|---|---|---|---|
34.7 (+1.7,-0.) | CID | Armentrout and Kickel, 1994 | gas phase; guided ion beam CID; M |
By formula: Li+ + C3H6 = (Li+ • C3H6)
Quantity | Value | Units | Method | Reference | Comment |
---|---|---|---|---|---|
ΔrH° | 23. | kcal/mol | ICR | Staley and Beauchamp, 1975 | gas phase; switching reaction(Li+)H2O, from graph; Dzidic and Kebarle, 1970 extrapolated; M |
By formula: Rh+ + C3H6 = (Rh+ • C3H6)
Enthalpy of reaction
ΔrH° (kcal/mol) | T (K) | Method | Reference | Comment |
---|---|---|---|---|
28.1 | CID | Chen and Armetrout, 1995 | gas phase; ΔrH>=, guided ion beam CID; M |

Kovats' RI, non-polar column, custom temperature program

Data compiled by: NIST Mass Spectrometry Data Center, William E. Wallace, director

Column type CapillaryCapillary
Active phase Petrocol DH-100DB-1
Column length (m) 100.60.
Carrier gas HeHe
Substrate
Column diameter (mm) 0.20.32
Phase thickness (μm)  1.0
Program 5C(10min) => 5C/min => 50C(48min) => 1.5C/min => 195C(91min)-40 C for 12 min; -40 - 125 C at 3 deg.min; 125-185 C at 6 deg/min; 185 - 220 C at 20 deg/min; hold 220 C for 2 min
I 283.290.
ReferenceHaagen-Smit Laboratory, 1997Hoekman, 1993
Comment MSDC-RI MSDC-RI

Van Den Dool and Kratz RI, non-polar column, custom temperature program

Data compiled by: NIST Mass Spectrometry Data Center, William E. Wallace, director

Column type Packed
Active phase SE-30
Column length (m) 3.05
Carrier gas
Substrate Supelcoport; Chromosorb
Column diameter (mm)
Phase thickness (μm)
Program 40C(5min) => 10C/min => 200C or 250C (60min)
I 294.
ReferencePeng, Ding, et al., 1988
Comment MSDC-RI

Normal alkane RI, non-polar column, custom temperature program

Data compiled by: NIST Mass Spectrometry Data Center, William E. Wallace, director

Column type CapillaryCapillaryCapillaryCapillaryCapillary
Active phase Methyl SiliconeMethyl SiliconeMethyl SiliconeSPB-1Polydimethyl siloxanes
Column length (m)  60. 60.
Carrier gas  Helium He
Substrate
Column diameter (mm)  0.32 0.53
Phase thickness (μm)  1.0 5.
Program not specified-50 0C (2 min) 8 0C/min -> 200 0C (7.75 min) 25 0C -> 225 0C (8 min)not specified40C(6min) => 5C/min => 80C => 10C/min => 200Cnot specified
I 288.290.290.283.290.
ReferenceChen and Feng, 2007Blunden, Aneja, et al., 2005Zenkevich, 2000Flanagan, Streete, et al., 1997Zenkevich, Chupalov, et al., 1996
Comment MSDC-RI MSDC-RI MSDC-RI MSDC-RI MSDC-RI
Column type CapillaryCapillaryCapillaryPackedPacked
Active phase Polydimethyl siloxanesSPB-1SPB-1Apieson LSE-30
Column length (m)  60.60.20.6.1
Carrier gas  HeliumHelium N2
Substrate    Chromosorb WChromosorb W
Column diameter (mm)  0.530.53
Phase thickness (μm)  5.05.0
Program not specified40 0C (6 min) 5 0C/min -> 80 0C 10 0C/min -> 200 0Cnot specifiednot specified50C910min) => 20C/min => 90(6min) => 10C/min => 150C(hold)
I 290.283.310.280.290.
ReferenceZenkevich and Chupalov, 1996Strete, Ruprah, et al., 1992Strete, Ruprah, et al., 1992Kojima, Fujii, et al., 1980Robinson and Odell, 1971
Comment MSDC-RI MSDC-RI MSDC-RI MSDC-RI MSDC-RI

Normal alkane RI, non-polar column, temperature ramp

Data compiled by: NIST Mass Spectrometry Data Center, William E. Wallace, director

Column type CapillaryCapillaryCapillaryCapillaryCapillary
Active phase Polydimethyl siloxane: CP-Sil 5 CBPetrocol DHUltra-ALLOY-5Ultra-ALLOY-5Ultra-ALLOY-5
Column length (m) 60.100.30.30.30.
Carrier gas HeliumHelium
Substrate
Column diameter (mm) 0.250.250.250.250.25
Phase thickness (μm) 1.00.500.250.250.25
Tstart (C) 45.20.40.40.40.
Tend (C) 210.220.320.320.320.
Heat rate (K/min) 3.615.20.20.20.
Initial hold (min) 1.4515.2.2.2.
Final hold (min) 2.7230.13.13.13.
I 286.294.295.295.295.
ReferenceBramston-Cook, 2013Supelco, 2012Tsuge, Ohtan, et al., 2011Tsuge, Ohtan, et al., 2011Tsuge, Ohtan, et al., 2011
Comment MSDC-RI MSDC-RI MSDC-RI MSDC-RI MSDC-RI
Column type CapillaryCapillaryCapillary
Active phase Ultra-ALLOY-5Ultra-ALLOY-5OV-101
Column length (m) 30.30.52.
Carrier gas   N2
Substrate
Column diameter (mm) 0.250.250.26
Phase thickness (μm) 0.250.25
Tstart (C) 40.40.50.
Tend (C) 320.320.220.
Heat rate (K/min) 20.20.3.
Initial hold (min) 2.2.
Final hold (min) 13.13.
I 295.298.290.
ReferenceTsuge, Ohtan, et al., 2011Tsuge, Ohtan, et al., 2011Chupalov and Zenkevich, 1996
Comment MSDC-RI MSDC-RI MSDC-RI

References

Furuyama, Golden, et al., 1969
Furuyama, S.; Golden, D.M.; Benson, S.W.,
Thermochemistry of the gas phase equilibria i-C3H7I = C3H6 + HI, n-C3H7I = i-C3H7I, and C3H6 + 2HI = C3H8 + I2,
J. Chem. Thermodyn., 1969, 1, 363-375. [all data]
Lacher, Walden, et al., 1950
Lacher, J.R.; Walden, C.H.; Lea, K.R.; Park, J.D.,
Vapor phase heats of hydrobromination of cyclopropane and propylene,
J. Am. Chem. Soc., 1950, 72, 331-333. [all data]
Wiberg and Fenoglio, 1968
Wiberg, K.B.; Fenoglio, R.A.,
Heats of formation of C4H6 hydrocarbons,
J. Am. Chem. Soc., 1968, 90, 3395-3397. [all data]
Rossini and Knowlton, 1937
Rossini, F.d.; Knowlton, J.W.,
Calorimetric determination of the heats of combustion of ethylene and propylene,
J. Res. NBS, 1937, 19, 249-262. [all data]
Cox and Pilcher, 1970
Cox, J.D.; Pilcher, G.,
Thermochemistry of Organic and Organometallic Compounds, Academic Press, New York, 1970, 1-636. [all data]
Thermodynamics Research Center, 1997
Thermodynamics Research Center,
Selected Values of Properties of Chemical Compounds., Thermodynamics Research Center, Texas A&M University, College Station, Texas, 1997. [all data]
Crawford B.L., 1939
Crawford B.L., Jr.,
The entropy and heat capacity of propylene,
J. Am. Chem. Soc., 1939, 61, 2980-2981. [all data]
Kilpatrick J.E., 1946
Kilpatrick J.E.,
Heat content, free energy function, entropy, and heat capacity of ethylene, propylene, and the four butenes to 1500 K,
J. Res. Nat. Bur. Stand, 1946, 37, 163-171. [all data]
Kilpatrick J.E., 1947
Kilpatrick J.E.,
Normal coordinate analysis of the vibrational frequencies of ethylene, propylene, cis-2-butene, trans-2-butene, and isobutene,
J. Res. Nat. Bur. Stand., 1947, 38, 191-209. [all data]
Chao J., 1975
Chao J.,
Ideal gas thermodynamic properties of ethylene and propylene,
J. Phys. Chem. Ref. Data, 1975, 4, 251-261. [all data]
East A.L.L., 1997
East A.L.L.,
Ab initio statistical thermodynamical models for the computation of third-law entropies,
J. Chem. Phys., 1997, 106, 6655-6674. [all data]
Bier K., 1974
Bier K.,
Thermodynamic properties of propylene from calorimetric measurements,
J. Chem. Thermodyn., 1974, 6, 1039-1052. [all data]
Kistiakowsky G.B., 1940
Kistiakowsky G.B.,
The low temperature gaseous heat capacities of certain C3 hydrocarbons,
J. Chem. Phys., 1940, 8, 970-977. [all data]
Kistiakowsky G.B., 1940, 2
Kistiakowsky G.B.,
Gaseous heat capacities. II,
J. Chem. Phys., 1940, 8, 610-618. [all data]
Telfair D., 1942
Telfair D.,
Supersonic measurement of the heat capacity of propylene,
J. Chem. Phys., 1942, 10, 167-171. [all data]
Chao, Hall, et al., 1983
Chao, J.; Hall, K.R.; Yao, J.M.,
Thermodynamic properties of simple alkenes,
Thermochim. Acta, 1983, 64(3), 285-303. [all data]
Auerbach, Sage, et al., 1950
Auerbach, C.E.; Sage, B.H.; Lacey, W.N.,
Isobaric heat capacities at bubble point,
Ind. Eng. Chem., 1950, 42, 110-113. [all data]
Powell and Giauque, 1939
Powell, T.M.; Giauque, W.F.,
Propylene. The heat capacity, vapor pressure, heats of fusion and vaporization. The third law of thermodynamics and orientation equilibrium in the solid,
J. Am. Chem. Soc., 1939, 61, 2366-2370. [all data]
Huffman, Parks, et al., 1931
Huffman, H.M.; Parks, G.S.; Barmore, M.,
Thermal data on organic compounds. X. Further studies on the heat capacities, entropies and free energies of hydrocarbons,
J. Am. Chem. Soc., 1931, 53, 3876-3888. [all data]
Streng, 1971
Streng, A.G.,
Miscibility and Compatibility of Some Liquid and Solidified Gases at Low Temperature,
J. Chem. Eng. Data, 1971, 16, 357. [all data]
Haselden and Snowden, 1962
Haselden, G.G.; Snowden, P.,
Equilibrium Properties of the Carbon Dioxide+ Propylene and Carbon Dioxide + Cyclopropane Systems at Low Temperatures,
Trans. Faraday Soc., 1962, 58, 1515-28. [all data]
Parks and Huffman, 1931
Parks, G.S.; Huffman, H.M.,
Some fusion and transition data for hydrocarbons,
Ind. Eng. Chem., 1931, 23, 1138-9. [all data]
Coffin and Maass, 1927
Coffin, C.C.; Maass, O.,
The Prepartion and Physical Properties of Isobutylene,
Trans. R. Soc. Can., Sect. 3, 1927, 21, 33. [all data]
Angus, Armstrong, et al., 1980
Angus, S.; Armstrong, B.; de Reuck, K.M.,
International Thermodynamic Tables of the Fluid State - 7 Propylene(Propene), Pergamon, New York, 1980. [all data]
Tsonopoulos and Ambrose, 1996
Tsonopoulos, C.; Ambrose, D.,
Vapor-Liquid Critical Properties of Elements and Compounds. 6. Unsaturated Aliphatic Hydrocarbons,
J. Chem. Eng. Data, 1996, 41, 645-656. [all data]
Ohgaki, Umezono, et al., 1990
Ohgaki, K.; Umezono, S.; Katayama, T.,
Pressure-density-temperature (p-ρ-T) relations of fluoroform, nitrous oxide, and propene in the critical region,
J. Supercrit. Fluids, 1990, 3, 78-84. [all data]
Marchman, Prengle, et al., 1949
Marchman, H.; Prengle, H.W.; Motard, R.L.,
Compressibility and Critical Constants of Propylene Vapor,
Ind. Eng. Chem., 1949, 41, 2658. [all data]
Seibert and Burrell, 1915
Seibert, F.M.; Burrell, G.A.,
The Critical Constants of Normal Butane, Iso-butane and Propylene and Their Vapor Pressures at Temperatures Bewtween 0 deg.C and 120 deg.C,
J. Am. Chem. Soc., 1915, 37, 2683-91. [all data]
Majer and Svoboda, 1985
Majer, V.; Svoboda, V.,
Enthalpies of Vaporization of Organic Compounds: A Critical Review and Data Compilation, Blackwell Scientific Publications, Oxford, 1985, 300. [all data]
Stephenson and Malanowski, 1987
Stephenson, Richard M.; Malanowski, Stanislaw,
Handbook of the Thermodynamics of Organic Compounds, 1987, https://doi.org/10.1007/978-94-009-3173-2
. [all data]
Dykyj, 1970
Dykyj, J.,
Petrochemica, 1970, 10, 2, 51. [all data]
Michels, Wassenaar, et al., 1953
Michels, A.; Wassenaar, T.; Louwerse, P.; Lunbeck, R.J.; Wolkers, G.J.,
Isotherms and thermodynamical functions of propene at temperatures between 25° and 150°c and at densities up to 340 amagat (pressures up to 2800 atm),
Physica, 1953, 19, 1-12, 287-297, https://doi.org/10.1016/S0031-8914(53)80030-3
. [all data]
Maass and Wright, 1921
Maass, O.; Wright, C.H.,
SOME PHYSICAL PROPERTIES OF HYDROCARBONS CONTAINING TWO AND THREE CARBON ATOMS.,
J. Am. Chem. Soc., 1921, 43, 5, 1098-1111, https://doi.org/10.1021/ja01438a013
. [all data]
Boublik, Fried, et al., 1984
Boublik, T.; Fried, V.; Hala, E.,
The Vapour Pressures of Pure Substances: Selected Values of the Temperature Dependence of the Vapour Pressures of Some Pure Substances in the Normal and Low Pressure Region, 2nd ed., Elsevier, New York, 1984, 972. [all data]
Domalski and Hearing, 1996
Domalski, Eugene S.; Hearing, Elizabeth D.,
Heat Capacities and Entropies of Organic Compounds in the Condensed Phase. Volume III,
J. Phys. Chem. Ref. Data, 1996, 25, 1, 1, https://doi.org/10.1063/1.555985
. [all data]
Takeda, Oguni, et al., 1990
Takeda, K.; Oguni, M.; Suga, H.,
A DTA apparatus for vapour-deposited samples. Characterisation of some vapour-deposited hydrocarbons,
Thermochim. Acta, 1990, 158(1), 195-203. [all data]
Ellison, Davico, et al., 1996
Ellison, G.B.; Davico, G.E.; Bierbaum, V.M.; DePuy, C.H.,
Thermochemistry of theb Benzyl and Allyl Radicals and Ions,
Int. J. Mass Spectrom. Ion Proc., 1996, 156, 1-2, 109-131, https://doi.org/10.1016/S0168-1176(96)04383-2
. [all data]
Wenthold, Polak, et al., 1996
Wenthold, P.G.; Polak, M.L.; Lineberger, W.C.,
Photoelectron Spectroscopy of the Allyl and 2-Methylallyl Anions,
J. Phys. Chem., 1996, 100, 17, 6920, https://doi.org/10.1021/jp953401n
. [all data]
Bartmess, Scott, et al., 1979
Bartmess, J.E.; Scott, J.A.; McIver, R.T., Jr.,
The gas phase acidity scale from methanol to phenol,
J. Am. Chem. Soc., 1979, 101, 6047. [all data]
Mackay, Lien, et al., 1978
Mackay, G.I.; Lien, M.H.; Hopkinson, A.C.; Bohme, D.K.,
Experimental and theoretical studies of proton removal from propene,
Can. J. Chem., 1978, 56, 131. [all data]
Lacher, Kianpour, et al., 1957
Lacher, J.R.; Kianpour, A.; Park, J.D.,
Reaction heats of organic halogen compounds. X. Vapor phase heats of hydrobromination of cyclopropane and propylene,
J. Phys. Chem., 1957, 61, 1124-1125. [all data]
Lacher, Lea, et al., 1950
Lacher, J.R.; Lea, K.R.; Walden, C.H.; Olson, G.G.; Park, J.D.,
Reaction heats of organic fluorine compounds. III. The vapor phase heats of hydrobromination of some simple fluoroolefins,
J. Am. Chem. Soc., 1950, 72, 3231-3234. [all data]
Kistiakowsky and Nickle, 1951
Kistiakowsky, G.B.; Nickle, A.G.,
Ethane-ethylene and propane-propylene equilibria,
Faraday Discuss. Chem. Soc., 1951, 10, 175-187. [all data]
Kistiakowsky, Ruhoff, et al., 1935
Kistiakowsky, G.B.; Ruhoff, J.R.; Smith, H.A.; Vaughan, W.E.,
Heats of organic reactions. II. Hydrogenation of some simpler olefinic hydrocarbons,
J. Am. Chem. Soc., 1935, 57, 876-882. [all data]
DePuy, Gronert, et al., 1989
DePuy, C.H.; Gronert, S.; Barlow, S.E.; Bierbaum, V.M.; Damrauer, R.,
The Gas Phase Acidities of the Alkanes,
J. Am. Chem. Soc., 1989, 111, 6, 1968, https://doi.org/10.1021/ja00188a003
. [all data]
Froelicher, Freiser, et al., 1986
Froelicher, S.W.; Freiser, B.S.; Squires, R.R.,
The C3H5- isomers. Experimental and theoretical studies of the tautomeric propenyl ions and the cyclopropyl anion in the gas phase,
J. Am. Chem. Soc., 1986, 108, 2853. [all data]
Rodgers, Golden, et al., 1966
Rodgers, A.S.; Golden, D.M.; Benson, S.W.,
The thermochemistry of the gas phase equilibrium I2 + C3H6 = C3H5I + HI,
J. Am. Chem. Soc., 1966, 88, 3194-3196. [all data]
Noren and Sunner, 1970
Noren, I.; Sunner, S.,
The enthalpy of formation of 2-chloropropane from equilibrium studies,
J. Chem. Thermodyn., 1970, 2, 597-602. [all data]
Kabo and Andreevskii, 1963
Kabo, G.Ya.; Andreevskii, D.N.,
Equilibrium of 2-chloropropane dehydrochlorination,
Neftekhimiya, 1963, 3, 764-770. [all data]
Howlett, 1955
Howlett, K.E.,
The use of equilibrium constants to calculate thermodynamic quantities. Part II,
J. Chem. Soc., 1955, 1784-17. [all data]
Armentrout and Kickel, 1994
Armentrout, P.B.; Kickel, B.L.,
Gas Phase Thermochemistry of Transition Metal Ligand Systems: Reassessment of Values and Periodic Trends, in Organometallic Ion Chemistry, B. S. Freiser, ed, 1994. [all data]
Haynes and Armentrout, 1994
Haynes, C.L.; Armentrout, P.B.,
Thermochemistry and Structures of CoC3H6+: Metallacyclic and Metal-Alkene Isomers,
Organomettalics, 1994, 13, 9, 3480, https://doi.org/10.1021/om00021a022
. [all data]
Li and Stone, 1989
Li, X.; Stone, J.A.,
Determination of the beta silicon effect from a mass spectrometric study of the association of trimethylsilylium ion with alkenes,
J. Am. Chem. Soc., 1989, 111, 15, 5586, https://doi.org/10.1021/ja00197a013
. [all data]
Conn, Kistiakowsky, et al., 1938
Conn, J.B.; Kistiakowsky, G.B.; Smith, E.A.,
Heats of organic reactions. VII. Addition of halogens to olefins,
J. Am. Chem. Soc., 1938, 60, 2764-2771. [all data]
Staley and Beauchamp, 1975
Staley, R.H.; Beauchamp, J.L.,
Intrinsic Acid - Base Properties of Molecules. Binding Energies of Li+ to pi - and n - Donor Bases,
J. Am. Chem. Soc., 1975, 97, 20, 5920, https://doi.org/10.1021/ja00853a050
. [all data]
Dzidic and Kebarle, 1970
Dzidic, I.; Kebarle, P.,
Hydration of the Alkali Ions in the Gas Phase. Enthalpies and Entropies of Reactions M+(H2O)n-1 + H2O = M+(H2O)n,
J. Phys. Chem., 1970, 74, 7, 1466, https://doi.org/10.1021/j100702a013
. [all data]
Chen and Armetrout, 1995
Chen, Y.M.; Armetrout, P.B.,
Activation of C2H6, C3H8, and c-C3H6 by Gas-Phase Rh+ and the Thermochemistry of Rh-Ligand Complexes,
J. Am. Chem. Soc., 1995, 117, 36, 9291, https://doi.org/10.1021/ja00141a022
. [all data]
Entelis, Korovina, et al., 1960
Entelis, S.G.; Korovina, G.V.; Chirkov, N.M.,
The thermodynamics of propylene absorption by the H2SO4-H20 system,
Dokl. Akad. Nauk SSSR, 1960, 134, 856-859. [all data]
Benson and Amano, 1962
Benson, S.W.; Amano, A.,
Thermodynamics of iodine addition to ethylene, propylene, and cyclopropane,
J. Chem. Phys., 1962, 36, 3464-3471. [all data]
Rozhnov and Andreevskii, 1962
Rozhnov, A.M.; Andreevskii, D.N.,
Equilibrium in the system propene, hydrogen bromide, bromopropane,
Dokl. Akad. Nauk SSSR, 1962, 147, 388-391. [all data]
Moore, 1971
Moore, L.O.,
Kinetics and thermodynamic data for the hydrogen fluoride addition to vinyl fluoride,
Can. J. Chem., 1971, 49, 2471-2475. [all data]
Schroeder, Hrusak, et al., 1995
Schroeder, D.; Hrusak, J.; Hertwig, R.H.; Koch, W.; Schwerdtfeger, P.; Schwarz, H.,
Experimental and Theoretical Studies of Gold(I) Complexes Au(L)+ (L=H2O, CO, NH3, C2H4, C3H6, C4H6, C6H6, C6F6),
Organometallics, 1995, 14, 1, 312, https://doi.org/10.1021/om00001a045
. [all data]
Hunter and Lias, 1998
Hunter, E.P.; Lias, S.G.,
Evaluated Gas Phase Basicities and Proton Affinities of Molecules: An Update,
J. Phys. Chem. Ref. Data, 1998, 27, 3, 413-656, https://doi.org/10.1063/1.556018
. [all data]
Traeger, 1984
Traeger, J.C.,
A study of the allyl cation thermochemistry by photoionization mass spectrometry,
Int. J. Mass Spectrom. Ion Processes, 1984, 58, 259. [all data]
Selim, 1980
Selim, E.T.M.,
Ionization dissociation of propylene by electron impact,
Indian J. Pure Appl. Phys., 1980, 18, 31. [all data]
Wood and Taylor, 1979
Wood, K.V.; Taylor, J.W.,
A photoionization mass spectrometric study of autoionization in ethylene and trans-2-butene,
Int. J. Mass Spectrom. Ion Phys., 1979, 30, 307. [all data]
Bieri, Burger, et al., 1977
Bieri, G.; Burger, F.; Heilbronner, E.; Maier, J.P.,
Valence ionization enrgies of hydrocarbons,
Helv. Chim. Acta, 1977, 60, 2213. [all data]
Krassig, Reinke, et al., 1974
Krassig, R.; Reinke, D.; Baumgartel, H.,
Photo-reaktionen kleiner organischer molekule II. Die photoionenspektren der Isomeren propylen-cyclopropan und acetaldehyd-athylenoxyd,
Ber. Bunsen-Ges. Phys. Chem., 1974, 78, 425. [all data]
Masclet, Grosjean, et al., 1973
Masclet, P.; Grosjean, D.; Mouvier, G.,
Alkene ionization potentials. Part I. Quantitative determination of alkyl group structural effects,
J. Electron Spectrosc. Relat. Phenom., 1973, 2, 225. [all data]
Katrib and Rabalais, 1973
Katrib, A.; Rabalais, J.W.,
Electronic interaction between the vinyl group and its substituents,
J. Phys. Chem., 1973, 77, 2358. [all data]
Lossing, 1972
Lossing, F.P.,
Free radicals by mass spectrometry. XLV. Ionization potentials and heats of formation of C3H3, C3H5, and C4H7 radicals and ions,
Can. J. Chem., 1972, 50, 3973. [all data]
Frost and Sandhu, 1971
Frost, D.C.; Sandhu, J.S.,
Ionization potentials of ethylene and some methyl-substituted ethylenes as determined by photoelectron spectroscopy,
Indian J. Chem., 1971, 9, 1105. [all data]
Person and Nicole, 1970
Person, J.C.; Nicole, P.P.,
Isotope effects in the photoionization yields and the absorption cross sections for acetylene, propyne, and propene,
J. Chem. Phys., 1970, 53, 1767. [all data]
Dewar and Worley, 1969
Dewar, M.J.S.; Worley, S.D.,
Photoelectron spectra of molecules. I. Ionization potentials of some organic molecules and their interpretation,
J. Chem. Phys., 1969, 50, 654. [all data]
Cermak, 1968
Cermak, V.,
Penning ionization electron spectroscopy. I. Determination of ionization potentials of polyatomic molecules,
Collection Czech. Chem. Commun., 1968, 33, 2739. [all data]
Nicholson, 1965
Nicholson, A.J.C.,
Photoionization-efficiency curves. II. False and genuine structure,
J. Chem. Phys., 1965, 43, 1171. [all data]
Samson, Marmo, et al., 1962
Samson, J.A.R.; Marmo, F.F.; Watanabe, K.,
Absorption and photoionization coefficients of propylene and butene-1 in the vacuum ultraviolet,
J. Chem. Phys., 1962, 36, 783. [all data]
Steiner, Giese, et al., 1961
Steiner, B.; Giese, C.F.; Inghram, M.G.,
Photoionization of alkanes. Dissociation of excited molecular ions,
J. Chem. Phys., 1961, 34, 189. [all data]
Bralsford, Harris, et al., 1960
Bralsford, R.; Harris, P.V.; Price, W.C.,
The effect of fluorine on the electronic spectra and ionization potentials of molecules,
Proc. Roy. Soc. (London), 1960, A258, 459. [all data]
Watanabe, 1957
Watanabe, K.,
Ionization potentials of some molecules,
J. Chem. Phys., 1957, 26, 542. [all data]
Krause, Taylor, et al., 1978
Krause, D.A.; Taylor, J.W.; Fenske, R.F.,
An analysis of the effects of alkyl substituents on the ionization potentials of n-alkenes,
J. Am. Chem. Soc., 1978, 100, 718. [all data]
Kobayashi, 1978
Kobayashi, T.,
A simple general tendency in photoelectron angular distributions of some monosubstituted benzenes,
Phys. Lett., 1978, 69, 105. [all data]
Kimura, Katsumata, et al., 1975
Kimura, K.; Katsumata, S.; Yamazaki, T.; Wakabayashi, H.,
UV photoelectron spectra and sum rule consideration; out-of-plane orbitals of unsaturated compounds with planar-skeleton structure,
J. Electron Spectrosc. Relat. Phenom., 1975, 6, 41. [all data]
White, Carlson, et al., 1974
White, R.M.; Carlson, T.A.; Spears, D.P.,
Angular distribution of the photoelectron spectra for ethylene, propylene, butene and butadiene,
J. Electron Spectrosc. Relat. Phenom., 1974, 3, 59. [all data]
Hentrich, Gunkel, et al., 1974
Hentrich, G.; Gunkel, E.; Klessinger, M.,
Photoelektronenspektren organischer verbindungen. 4. Photoelektronenspektren ungesattigter carbonylverbindungen,
J. Mol. Struct., 1974, 21, 231. [all data]
Weidner and Schweig, 1972
Weidner, U.; Schweig, A.,
Theory and application of photoelectron spectroscopy. V. The nature of bonding in vinyl- and allylsilanes: the effects of σ-π (hyperconjugation) pπ-dπ conjugation in these compounds,
J. Organomet. Chem., 1972, 39, 261. [all data]
Mollere, Bock, et al., 1972
Mollere, P.; Bock, H.; Becker, G.; Fritz, G.,
Photoelectron spectra and molecular properties. XV. The effects of α- and β-silyl substituents on π-systems,
J. Organomet. Chem., 1972, 46, 89. [all data]
Peers and Vigny, 1968
Peers, A.M.; Vigny, P.,
Reactions molecule-ion dans le propylene,
J. Chim. Phys., 1968, 65, 805. [all data]
Haney and Franklin, 1968
Haney, M.A.; Franklin, J.L.,
Correlation of excess energies of electron-impact dissociations with the translational energies of the products,
J.Chem. Phys., 1968, 48, 4093. [all data]
Harrison and Tait, 1962
Harrison, A.G.; Tait, J.M.S.,
Concurrent ion-molecule reactions leading to the same product ion,
Can. J. Chem., 1962, 40, 1986. [all data]
Omura, 1962
Omura, I.,
Study on unimolecular decomposition of excited olefin ions,
Bull. Chem. Soc. Japan, 1962, 35, 1845. [all data]
Omura, 1961
Omura, I.,
Mass spectra at low ionizing voltage and bond dissociation energies of molecular ions from hydrocarbons,
Bull. Chem. Soc. Japan, 1961, 34, 1227. [all data]
Buttrill, Williamson, et al., 1975
Buttrill, S.E., Jr.; Williamson, A.D.; LeBreton, P.,
Photoionization measurement of the heat of formation of allyl cations,
J. Chem. Phys., 1975, 62, 1586. [all data]
Lossing, 1971
Lossing, F.P.,
Free radicals by mass spectrometry. XLIII. Ionization potentials and ionic heats of formation for vinyl, allyl, and benzyl radicals,
Can. J. Chem., 1971, 49, 357. [all data]