9H-Carbazole, 9-phenyl-
- Formula: C18H13N
- Molecular weight: 243.3025
- IUPAC Standard InChIKey: VIJYEGDOKCKUOL-UHFFFAOYSA-N
- CAS Registry Number: 1150-62-5
- Chemical structure:
View 3d structure (requires JavaScript / HTML 5) - Other names: Carbazole, 9-phenyl-; N-Phenylcarbazole; 9-Phenylcarbazole; Carbazol, 9-phenyl

Gas phase ion energetics data

Data compiled by: Henry M. Rosenstock, Keith Draxl, Bruce W. Steiner, and John T. Herron
Ionization energy determinations
IE (eV) | Method | Reference |
---|---|---|
7.7 ± 0.1 | EI | Riepe and Zander, 1969 |

Lee's RI, non-polar column, temperature ramp

Column type | Active phase | I | Reference | Comment |
---|---|---|---|---|
Capillary | SE-52 | 381.51 | Vassilaros, Kong, et al., 1982 | 20. m/0.30 mm/0.25 μm, H2, 40. C @ 2. min, 4. K/min; Tend: 265. C |
Capillary | SE-52 | 382.09 | Lee, Vassilaros, et al., 1979 | 12. m/0.3 mm/0.34 μm, He, 2. K/min; Tstart: 50. C; Tend: 250. C |

Lee's RI, non-polar column, custom temperature program

Column type | Active phase | I | Reference | Comment |
---|---|---|---|---|
Capillary | HP-5 | 377.06 | Reckendorf, 1997 | 25. m/0.2 mm/0.11 μm, He; Program: 106C(0.2min) => 40C/min => 120C => 3C/min => 310C(10min) |

References

Riepe and Zander, 1969
Riepe, W.; Zander, M.,
Massenspektroskopische Untersuchungen an Carbazolen,
Z. Naturforsch., 1969, 24a, 2017. [all data]
Zander, 1966
Zander, M.,
UV atlas of organic compounds, 1966, 1, H16/1. [all data]
Vassilaros, Kong, et al., 1982
Vassilaros, D.L.; Kong, R.C.; Later, D.W.; Lee, M.L.,
Linear retention index system for polycyclic aromatic compounds. Critical evaluation and additional indices,
J. Chromatogr., 1982, 252, 1-20, https://doi.org/10.1016/S0021-9673(01)88394-1
. [all data]
Lee, Vassilaros, et al., 1979
Lee, M.L.; Vassilaros, D.L.; White, C.M.; Novotny, M.,
Retention Indices for Programmed-Temperature Capillary-Column Gas Chromatography of Polycyclic Aromatic Hydrocarbons,
Anal. Chem., 1979, 51, 6, 768-773, https://doi.org/10.1021/ac50042a043
. [all data]
Reckendorf, 1997
Reckendorf, R.M.,
Identification of phenyl-substituted polycyclic aromatic compounds in ring furnace gases using GC-MS and GC-AED,
Chromatographia, 1997, 45, 1, 173-182, https://doi.org/10.1007/BF02505557
. [all data]