HPOH

Vibrational and/or electronic energy levels

Data compiled by: Marilyn E. Jacox

State:   X

Vib.
sym.
 No.   Approximate
 type of mode
 cm-1   Med.   Method   References

POH deform. 1094.4 Ar IR Withnall and Andrews, 1988
HPO deform. 955.7 Ar IR Withnall and Andrews, 1988
P-O stretch 817.7 Ar IR Withnall and Andrews, 1988
Torsion 406.3 Ar IR Withnall and Andrews, 1988

Additional references: Jacox, 1994, page 151

References

Withnall and Andrews, 1988
Withnall, R.; Andrews, L., Infrared spectra of oxygen atom-phosphine reaction products trapped in solid argon, J. Phys. Chem., 1988, 92, 16, 4610, https://doi.org/10.1021/j100327a012 . [all data]

Jacox, 1994
Jacox, M.E., Vibrational and electronic energy levels of polyatomic transient molecules, American Chemical Society, Washington, DC, 1994, 464. [all data]