1,2-Diphenyltetramethyldisilane
- Formula: C16H22Si2
- Molecular weight: 270.5169
- IUPAC Standard InChIKey: IIOOIYHUTINYQO-UHFFFAOYSA-N
- CAS Registry Number: 1145-98-8
- Chemical structure:
View 3d structure (requires JavaScript / HTML 5) - Other names: Disilane,1,1,2,2-tetramethyl-1,2-diphenyl-

Gas phase ion energetics data

Data compiled by: Sharon G. Lias, Rhoda D. Levin, and Sherif A. Kafafi
Ionization energy determinations
IE (eV) | Method | Reference | Comment |
---|---|---|---|
7.7 | PE | Traven', Redchenko, et al., 1981 | |
8.11 ± 0.15 | EI | Gaidis, Briggs, et al., 1971 | |
8.23 | PE | Traven', Redchenko, et al., 1981 | Vertical value |
Appearance energy determinations
Ion | AE (eV) | Other Products | Method | Reference | Comment |
---|---|---|---|---|---|
C3H9Si+ | 11.04 ± 0.03 | (C6H5)2SiC | EI | Gaidis, Briggs, et al., 1971 | |
C8H11Si+ | 9.87 ± 0.08 | C6H5Si(CH3 | EI | Gaidis, Briggs, et al., 1971 | |
C13H13Si+ | 9.60 ± 0.02 | (CH3)3Si | EI | Gaidis, Briggs, et al., 1971 |

References

Traven', Redchenko, et al., 1981
Traven', V.F.; Redchenko, V.V.; Eismont, M.Y.; Stepanov, B.I.,
Photoelectron spectra and electronic and steric structures of silicon and sulfur-containing analogs of 9,10-dihydroanthracene,
J. Gen. Chem. USSR, 1981, 51, 1099, In original 1297. [all data]
Gaidis, Briggs, et al., 1971
Gaidis, J.M.; Briggs, P.R.; Shannon, T.W.,
Mass spectra of disilanes. Phenyl-silicon interaction and silicon-silicon bond strength,
J. Phys. Chem., 1971, 75, 974. [all data]
Lang (editor), 1971
Lang (editor), L.,
Absorption Spectra in the Ultraviolet and Visible Region, 1971, 15, 391. [all data]